{"text_format":"1","workbook":"xlsx","n_sheets":31,"sheets":["INFO","MENU","Istruzioni","ALL_A","ALL_A.1","ALL_A.2","ALL_C","ALL_C_PERSONALE","ALL_C_IMPRESE_ASSOCIATE","ALL_D","EXP_PROGRAMMA","EXP_SOGGETTI_BIL_VOCI","EXP_STATO_DOMANDA","EXP_IMPRESE_ASSOCIATE","EXP_SOCI","EXP_ADDETTI_ANNO_CONTRATTO","EXP_ADDETTI_ANNO_ISTRUZIONE","EXP_PARTECIPAZIONI","EXP_PREVISIONI_SINTESI","EXP_SOGGETTI_BIL","EXP_PREVISIONI_COSTI_DETTAGLIO","EXP_PREVISIONI_PERSONALE_STD","EXP_PREVISIONI_PERSONALE_ANNO","EXP_PREVIS_PERS_NON_DIP_ANNO","EXP_PREVIS_PERS_TOT_ORE_ANNO","EXP_PREVIS_PERS_IND_ANNO","EXP_PREVIS_PERS_IND_AMM_ANNO","EXP_PREVIS_PERS_IND_SPEGEN_ANNO","EXP_PREV_COSTI_IMPRESE_ASS_TIPO","EXP_PREV_COSTI_IMPRESE_ASS_FIN","EXP_PREVISIONI_VENDITE"],"not_rendered":{"charts":0,"images":5,"macros":1,"external_links":0,"defined_names":28,"comments":0,"pivot_tables":0},"unopened":[],"bounds":{"document_bytes":16777216,"sheet_cells":100000,"rows_first":2000,"rows_last":500,"rows_between":2000,"halvings":0,"cell_chars":16384,"cell_head_chars":4096},"cells_cut":0,"cells_raw":0,"read":"whole","date_system":"1900"}

{"sheet":"INFO","index":0,"n_rows":14,"n_cols":5,"rows_kept":14,"cut":false,"hidden":false,"merged":[[2,4,2,11],[0,4,0,11],[1,4,1,11],[13,0,13,12],[4,0,4,12],[5,0,9,12],[10,0,10,16383],[11,0,11,12],[12,0,12,16383]]}
[null,null,null,null,{"$f":"MENU!B5","v":"Direzione generale per la politica industriale, la competitività e le PMI"}]
[null,null,null,null,{"$f":"MENU!B7","v":"Divisione IX “Industrie aerospazio,  difesa e sicurezza”"}]
[]
[]
["ATTENZIONE!"]
["Per accedere ai fogli di compilazione dei dati richiesti è necessario attivare le macro. Per attivare le macro scegliere \"attiva macro\" all'apertura del file.\nNel caso in cui all'apertura del file non comparisse alcun messaggio per attivare le macro, utilizzare la seguente procedura:"]
[]
[]
[]
[]
["A. MS Excel 2000, 2002 e 2003: "]
["   - attivare il menu \"Strumenti - Macro - Protezione\"\n   - scegliere il livello di protezione \"medio\";\n   - chiudere il file Excel e riaprirlo scegliendo all'apertura \"attiva macro\""]
["MS Excel 2007 / 2010 (2013 / 2016 / 2019): "]
["   - attivare il tasto di Office sull'angolo in alto a sinistra di MS Excel          (2013 / 2016 / 2019: File)\n   - scegliere \"Opzioni di Excel\"  (2013 / 2016 / 2019: Opzioni)\n   - scegliere \"Centro di protezione\"  (2013 / 2016 / 2019: Centro protezione)\n   - scegliere \"Impostazioni centro protezione\"\n   - scegliere \"Impostazioni macro\"  (2013 / 2016 / 2019: Impostazioni delle macro)\n   - scegliere \"disattiva tutte le macro con notifica\" (2013 / 2016 / 2019: Disabilita tutte le macro con notifica\")\n   - chiudere il file Excel e riaprirlo\n   - (2013 / 2016 / 2019: Scegliere sulla barra degli avvisi di protezioni \"Abilita contenuto\")\n   - scegliere sulla barra degli avvisi di protezioni \"opzioni\"\n   - scegliere \"attiva macro\"\n"]

{"sheet":"MENU","index":1,"n_rows":28,"n_cols":21,"rows_kept":28,"cut":false,"hidden":true,"merged":[[22,2,22,6],[23,2,23,6],[20,7,20,10],[21,7,21,10],[22,7,22,10],[23,7,23,10],[20,3,20,6],[21,3,21,6],[1,5,1,9],[19,2,19,6],[17,7,17,10],[19,7,19,10],[4,1,4,12],[17,2,17,6],[10,1,10,12],[12,2,13,11],[8,1,8,12],[6,1,6,12],[15,2,15,5]]}
[]
[null,null,null,null,null,"Ministero dello \nSviluppo economico",null,null,null,null,null,"Rel. del giugno 2019",10]
[null,null,3]
[]
[null,"Direzione generale per la politica industriale, la competitività e le PMI"]
[]
[null,"Divisione IX “Industrie aerospazio,  difesa e sicurezza”"]
[]
[null,"D.M. 20.2.2019  Regime di aiuto per progetti di ricerca e sviluppo nel settore aerospaziale."]
[]
[]
[]
[null,null,"MODULO DI COMPILAZIONE DELLA DOMANDA EX L. 808/85"]
[]
[]
[null,null,"Istruzioni per la compilazione della domanda"]
[]
[null,null,"MODULI DA COMPILARE",null,null,null,null,"STATO COMPILAZIONE",null,null,null,null,null,null,null,null,null,null,null,null,{"$f":"CONCATENATE(ALL_A!$K$7:$K$400)","v":""}]
[]
[null,null,"Allegato A: Dati generali sul Progetto e sull'impresa richiedente",null,null,null,null,{"$f":"IF(ALL_A!$L$402<>\"\",\"Riscontrati errori/incoerenze\",IF(ALL_A!$K$402<>\"\",\"Compilazione da completare\",\"Ok\"))","v":"Compilazione da completare"},null,null,null,{"$f":"IF(H20<>\"Ok\",\"doppio click qui per maggiori dettagli\",\"\")","v":"doppio click qui per maggiori dettagli"},null,null,null,null,null,null,null,null,{"$f":"CONCATENATE(ALL_A!$K$7:$K$400)","v":""}]
[null,null,null,"ALLEGATO A.1: ELEMENTI PATRIMONIALI",null,null,null,{"$f":"IF(ALL_A.1!M52<>\"\",\"Riscontrati errori/incoerenze\",IF(ALL_A.1!L52<>\"\",\"Compilazione da completare\",\"Ok\"))","v":"Compilazione da completare"},null,null,null,{"$f":"IF(H21<>\"Ok\",\"doppio click qui per maggiori dettagli\",\"\")","v":"doppio click qui per maggiori dettagli"},null,null,null,null,null,null,null,null,{"$f":"CONCATENATE(ALL_A!$K$7:$K$400)","v":""}]
[null,null,null,"ALLEGATO A.2: ELEMENTI DEL CONTO ECONOMICO",null,null,null,{"$f":"IF(ALL_A.2!L56<>\"\",\"Riscontrati errori/incoerenze\",IF(ALL_A.2!K56<>\"\",\"Compilazione da completare\",\"Ok\"))","v":"Compilazione da completare"},null,null,null,{"$f":"IF(H22<>\"Ok\",\"doppio click qui per maggiori dettagli\",\"\")","v":"doppio click qui per maggiori dettagli"}]
[null,null,"Allegato C: Previsioni di costo del Progetto",null,null,null,null,{"$f":"IF(ALL_C!$X$581<>\"\",\"Riscontrati errori/incoerenze\",IF(ALL_C!$W$581<>\"\",\"Compilazione da completare\",\"Ok\"))","v":"Compilazione da completare"},null,null,null,{"$f":"IF(H23<>\"Ok\",\"doppio click qui per maggiori dettagli\",\"\")","v":"doppio click qui per maggiori dettagli"}]
[null,null,"Allegato D: Previsioni delle vendite del Programma",null,null,null,null,{"$f":"IF(ALL_D!$AJ$17<>\"\",\"Riscontrati errori/incoerenze\",IF(ALL_D!$AI$17<>\"\",\"Compilazione da completare\",\"Ok\"))","v":"Compilazione da completare"},null,null,null,{"$f":"IF(H24<>\"Ok\",\"doppio click qui per maggiori dettagli\",\"\")","v":"doppio click qui per maggiori dettagli"}]
[]
[]
[]
[null,null,"Per l'allegato B compilare l'apposito formulario in formato Word."]

{"sheet":"Istruzioni","index":2,"n_rows":29,"n_cols":5,"rows_kept":29,"cut":false,"hidden":true,"merged":[[28,1,28,12],[7,2,8,11],[12,1,13,12],[16,1,20,12],[23,1,25,12],[10,1,10,12],[1,2,4,3],[1,4,1,12],[2,4,2,12],[4,4,4,12],[5,4,5,12]]}
[]
[null,null,"Ministero dello\nSviluppo economico"]
[null,null,null,null,{"$f":"MENU!B5","v":"Direzione generale per la politica industriale, la competitività e le PMI"}]
[]
[null,null,null,null,{"$f":"MENU!B7","v":"Divisione IX “Industrie aerospazio,  difesa e sicurezza”"}]
[null,"Torna al menu principale",null,null,"DOMANDA DI ACCESSO AI PROGETTI DI RICERCA E SVILUPPO EX. L. 808/85\n- Istruzioni per la compilazione -"]
[]
[null,null,"ISTRUZIONI PER LA COMPILAZIONE DELLA DOMANDA"]
[]
[null,"AVVERTENZE"]
[null,"Il file è predisposto per acquisire le informazioni societarie e sui costi del progetto nel sistema di gestione della Legge 808/85, oltre che per un controllo preliminare sui vincoli del bando e pertanto deve mantenere inalterata la propria struttura, tanto che per questo motivo i fogli di lavoro sono protetti.\nAl riguardo si raccomanda quindi di non alterare in alcun modo la struttura dei fogli, perché ciò potrebbe pregiudicare la possibilità di acquisizione dei dati nel sistema, costringendo così l’ufficio a chiedere una copia corretta alla Società proponente."]
[null,"NAVIGAZIONE"]
[null,"Attraverso il MENU è possibile navigare gli allegati utilizzando gli appositi collegamenti ipertestuali o attraverso le singole schede Excel.\nDa ciascun foglio è possibile tornare al menu principale utilizzando il comando \"Torna al menu principale\" posto in alto a sinistra di ciascun foglio, sotto il logo del Ministero dello Sviluppo Economico."]
[]
[]
[null,"COMPILAZIONE"]
[null,"Si raccomanda di prestare attenzione alle unità di misura e agli ordini di grandezza con cui vanno inseriti i valori delle informazioni richieste. Inoltre, si raccomanda di non aggiungere o eliminare celle, righe o colonne e di non copiare ed incollare valori o riferimenti da fogli esterni nelle celle.\nIniziare la compilazione dall'Allegato A, inserendo i dati generali sul Programma e sull'Azienda e attivando il pulsante \"SALVA I DATI DI BASE ED AVVIA COMPILAZIONE\": se sono stati inseriti tutti i dati richiesti, verranno resi visibili anche gli altri fogli e le altre informazioni oggetto di compilazione sull'allegato A.\nI fogli sono protetti ed è quindi necessario compilare le sole celle con lo sfondo giallo o verde. Tutte le altre celle sono calcolate e, conseguentemente, immodificabili.\nL'allegato A che raccoglie le notizie generali sul programma e sull'azienda è composto di tre parti: notizie sull'azienda in senso stretto (foglio ALL_A); alcuni elementi (non tutte le voci del bilancio) dello stato patrimoniale (foglio ALL_A.1); ed alcuni elementi (non tutte le voci di bilancio) del conto economico (foglio ALL_A.2). Compilando i dati economici, i dati del fatturato vengono automaticamente copiati nelle rispettive celle della tabella Fatturato dell'ALL_A, pertanto si consiglia prima di compilare gli ALL_A.2 e ALL_A.1.\nNel caso si tratti di una domanda presentata dall’impresa capofila di un’associazione di imprese, sarà resa visibile una tabella in cui inserire il totale dei costi sostenuti da ciascuna Società partecipante al progetto per valutarne il costo totale. Il totale dei costi sostenuti dalla società capofila, saranno copiati automaticamente dall’ALL_C pertanto si consiglia quindi di compilare preliminarmente i fogli dell’ALL_C e ALL_ C_ PERSONALE per consentire la valorizzazione della cella corrispondente.\n\nSi raccomanda di prestare attenzione alle unità di misura e agli ordini di grandezza con cui vanno inseriti i valori delle informazioni richieste.\n\nL'allegato B – Relazione Tecnica, non è presente in questo file e andrà compilato utilizzando l'apposito file Word scaricabile dal sito.\n\nL'allegato C raccoglie le informazioni sui costi del programma di finanziamento. Si consiglia di cominciare la compilazione dal'ALL_C_PERSONALE, dove verranno esposti i costi del personale (il link per accedervi si trova dopo le tabelle di sintesi C.1 - C.5). Al termine della sua compilazione, le tabelle riassuntive C.1, C.3, C.4 e C.5 risulteranno compilate per quanto concerne questi costi del personale. Successivamente, occorre compilare le tabelle con il dettaglio dei costi per materiali, strumenti ed attrezzature e servizi di consulenza. Queste informazioni verranno inserite automaticamente nelle tabelle C.1 e C.5 (in quest'ultima provvisoriamente). Il prospetto della previsione dei costi viene completato inserendo i costi totali dei materiali, degli strumenti ed attrezzature e dei servizi di consulenza per tipologia di attività. Si fa notare che la tabella C.5, essendo calcolata come differenza tra i costi totali, fino al completamento dell'inserimento dei valori, presenterà informazioni provvisorie.\n\nL'allegato D, infine, consente di inserire le informazioni sulle previsioni delle vendite in un arco temporale massimo di 30 anni."]
[]
[]
[]
[]
[]
[null,"VERIFICA COMPLETAMENTO E CORRETTEZZA COMPILAZIONE"]
[null,"Al termine della compilazione si potrà verificare la completezza e la correttezza della compilazione attraverso il MENU; in particolare andrà verificata la colonna \"STATO COMPILAZIONE\" in corrispondenza di ciascuno dei moduli compilati.\nIn generale, il file sarà pronto per la trasmissione una volta verificato che in corrispondenza della colonna \"STATO COMPILAZIONE\" tutti i moduli abbiano lo stato \"Ok\" che sarà facilmente verificabile dallo sfondo di colore verde delle singole celle.\nNel caso in cui dalla colonna \"STATO COMPILAZIONE\" risultino dei dati incompleti / errati, si potrà visualizzare un messaggio esplicativo facendo un \"doppio clic\" sulla cella a fianco riportante la dicitura: \"doppio click qui per maggiori dettagli\".\nGli errori o la presenza di dati incompleti, non consentono l’acquisizione del file nel sistema di gestione della L808/85 pertanto è necessario ottenere uno stato della compilazione corretto (stato – OK)."]
[]
[]
[]
[null,"TRASMISSIONE"]
[null,"Al termine della compilazione e della verifica il presente file Excel insieme al file Word della domanda e dell'allegato B, oltre alle eventuali dichiarazioni di atto notorio, andranno inviati via PEC all’indirizzo: dgpicpmi.div09@pec.mise.gov.it"]

{"sheet":"ALL_A","index":3,"n_rows":403,"n_cols":35,"rows_kept":403,"cut":false,"hidden":true,"merged":[[347,7,347,8],[358,7,358,8],[0,27,1,28],[338,7,338,8],[342,7,342,8],[49,7,49,8],[41,5,41,8],[42,2,42,4],[46,7,46,8],[47,7,47,8],[48,7,48,8],[46,2,46,5],[41,2,41,4],[42,5,42,8],[43,2,43,4],[332,7,332,8],[333,7,333,8],[334,7,334,8],[339,7,339,8],[340,7,340,8],[341,7,341,8],[314,7,314,8],[315,7,315,8],[316,7,316,8],[353,7,353,8],[350,7,350,8],[351,7,351,8],[344,7,344,8],[349,7,349,8],[369,7,369,8],[363,7,363,8],[364,7,364,8],[365,7,365,8],[366,7,366,8],[367,7,367,8],[368,7,368,8],[360,7,360,8],[352,7,352,8],[345,7,345,8],[348,7,348,8],[357,7,357,8],[362,7,362,8],[354,7,354,8],[355,7,355,8],[361,7,361,8],[356,7,356,8],[359,7,359,8],[346,7,346,8],[343,7,343,8],[326,7,326,8],[327,7,327,8],[328,7,328,8],[329,7,329,8],[330,7,330,8],[331,7,331,8],[320,7,320,8],[321,7,321,8],[322,7,322,8],[323,7,323,8],[324,7,324,8],[325,7,325,8],[336,7,336,8],[337,7,337,8],[335,7,335,8],[319,7,319,8],[308,7,308,8],[309,7,309,8],[310,7,310,8],[311,7,311,8],[312,7,312,8],[313,7,313,8],[302,7,302,8],[303,7,303,8],[304,7,304,8],[305,7,305,8],[306,7,306,8],[307,7,307,8],[317,7,317,8],[318,7,318,8],[296,7,296,8],[297,7,297,8],[298,7,298,8],[299,7,299,8],[300,7,300,8],[301,7,301,8],[290,7,290,8],[291,7,291,8],[292,7,292,8],[293,7,293,8],[294,7,294,8],[295,7,295,8],[284,7,284,8],[285,7,285,8],[286,7,286,8],[287,7,287,8],[288,7,288,8],[289,7,289,8],[278,7,278,8],[279,7,279,8],[280,7,280,8],[281,7,281,8],[282,7,282,8],[283,7,283,8],[272,7,272,8],[273,7,273,8],[274,7,274,8],[275,7,275,8],[276,7,276,8],[277,7,277,8],[266,7,266,8],[267,7,267,8],[268,7,268,8],[269,7,269,8],[270,7,270,8],[271,7,271,8],[260,7,260,8],[261,7,261,8],[262,7,262,8],[263,7,263,8],[264,7,264,8],[265,7,265,8],[254,7,254,8],[255,7,255,8],[256,7,256,8],[257,7,257,8],[258,7,258,8],[259,7,259,8],[248,7,248,8],[249,7,249,8],[250,7,250,8],[251,7,251,8],[252,7,252,8],[253,7,253,8],[242,7,242,8],[243,7,243,8],[244,7,244,8],[245,7,245,8],[246,7,246,8],[247,7,247,8],[236,7,236,8],[237,7,237,8],[238,7,238,8],[239,7,239,8],[240,7,240,8],[241,7,241,8],[62,2,62,6],[205,2,205,4],[233,7,233,8],[234,7,234,8],[235,7,235,8],[217,2,217,4],[218,2,218,4],[204,2,204,8],[227,2,227,5],[215,2,215,4],[63,2,63,6],[64,2,64,6],[214,2,214,4],[75,2,75,6],[76,2,76,6],[65,2,65,6],[66,2,66,6],[67,2,67,6],[229,7,229,8],[225,2,225,5],[226,2,226,5],[206,2,206,4],[52,2,52,6],[52,7,52,8],[206,5,206,8],[220,2,220,4],[208,2,208,7],[211,2,211,4],[225,7,225,8],[226,7,226,8],[227,7,227,8],[209,2,209,4],[210,2,210,4],[212,2,212,4],[213,2,213,4],[228,2,228,5],[229,2,229,5],[61,2,61,6],[205,5,205,8],[71,2,71,6],[72,2,72,6],[73,2,73,6],[347,2,347,5],[228,7,228,8],[230,7,230,8],[341,2,341,5],[342,2,342,5],[231,7,231,8],[232,7,232,8],[367,2,367,5],[368,2,368,5],[351,2,351,5],[352,2,352,5],[354,2,354,5],[348,2,348,5],[349,2,349,5],[355,2,355,5],[353,2,353,5],[343,2,343,5],[344,2,344,5],[345,2,345,5],[346,2,346,5],[350,2,350,5],[332,2,332,5],[333,2,333,5],[334,2,334,5],[369,2,369,5],[360,2,360,5],[365,2,365,5],[361,2,361,5],[362,2,362,5],[363,2,363,5],[364,2,364,5],[366,2,366,5],[356,2,356,5],[357,2,357,5],[359,2,359,5],[335,2,335,5],[336,2,336,5],[337,2,337,5],[338,2,338,5],[339,2,339,5],[340,2,340,5],[326,2,326,5],[327,2,327,5],[328,2,328,5],[329,2,329,5],[330,2,330,5],[331,2,331,5],[320,2,320,5],[321,2,321,5],[322,2,322,5],[323,2,323,5],[324,2,324,5],[325,2,325,5],[310,2,310,5],[315,2,315,5],[316,2,316,5],[317,2,317,5],[318,2,318,5],[319,2,319,5],[304,2,304,5],[305,2,305,5],[306,2,306,5],[307,2,307,5],[308,2,308,5],[309,2,309,5],[298,2,298,5],[299,2,299,5],[300,2,300,5],[301,2,301,5],[302,2,302,5],[303,2,303,5],[292,2,292,5],[293,2,293,5],[294,2,294,5],[295,2,295,5],[296,2,296,5],[297,2,297,5],[286,2,286,5],[287,2,287,5],[288,2,288,5],[289,2,289,5],[290,2,290,5],[291,2,291,5],[280,2,280,5],[281,2,281,5],[282,2,282,5],[283,2,283,5],[284,2,284,5],[285,2,285,5],[274,2,274,5],[275,2,275,5],[276,2,276,5],[277,2,277,5],[278,2,278,5],[279,2,279,5],[267,2,267,5],[269,2,269,5],[270,2,270,5],[271,2,271,5],[272,2,272,5],[273,2,273,5],[261,2,261,5],[262,2,262,5],[263,2,263,5],[264,2,264,5],[265,2,265,5],[266,2,266,5],[255,2,255,5],[256,2,256,5],[257,2,257,5],[258,2,258,5],[259,2,259,5],[260,2,260,5],[249,2,249,5],[250,2,250,5],[251,2,251,5],[252,2,252,5],[253,2,253,5],[254,2,254,5],[246,2,246,5],[247,2,247,5],[248,2,248,5],[239,2,239,5],[238,2,238,5],[235,2,235,5],[240,2,240,5],[241,2,241,5],[242,2,242,5],[236,2,236,5],[237,2,237,5],[74,2,74,6],[77,2,77,6],[78,2,78,6],[79,2,79,6],[80,2,80,6],[60,2,60,6],[4,5,4,8],[70,2,70,6],[68,2,68,6],[69,2,69,6],[39,5,39,8],[6,5,6,6],[45,7,45,8],[19,2,19,8],[37,2,37,8],[39,2,39,4],[12,2,12,4],[50,7,50,8],[55,2,55,6],[54,2,54,7],[58,2,58,6],[59,2,59,6],[56,2,56,6],[57,2,57,6],[0,3,3,4],[8,2,8,3],[14,2,14,4],[16,2,16,4],[15,2,15,4],[40,2,40,4],[40,5,40,8],[47,2,47,5],[48,2,48,5],[49,2,49,5],[50,2,50,5],[0,5,0,8],[1,5,1,8],[313,2,313,5],[314,2,314,5],[83,2,83,6],[84,2,84,6],[377,2,377,4],[81,2,81,6],[82,2,82,6],[99,2,99,6],[100,2,100,6],[89,2,89,6],[90,2,90,6],[91,2,91,6],[92,2,92,6],[93,2,93,6],[94,2,94,6],[95,2,95,6],[96,2,96,6],[97,2,97,6],[98,2,98,6],[85,2,85,6],[378,2,378,4],[111,2,111,6],[112,2,112,6],[101,2,101,6],[102,2,102,6],[103,2,103,6],[104,2,104,6],[105,2,105,6],[106,2,106,6],[107,2,107,6],[108,2,108,6],[109,2,109,6],[110,2,110,6],[123,2,123,6],[124,2,124,6],[113,2,113,6],[243,2,243,5],[244,2,244,5],[245,2,245,5],[132,2,132,6],[143,2,143,6],[144,2,144,6],[145,2,145,6],[146,2,146,6],[385,2,385,4],[380,2,380,7],[381,2,381,4],[382,2,382,4],[379,2,379,7],[384,2,384,7],[393,2,393,4],[396,2,396,4],[397,2,397,4],[398,2,398,4],[399,2,399,4],[395,2,395,7],[391,2,391,4],[386,2,386,4],[387,2,387,4],[388,2,388,4],[390,2,390,7],[392,2,392,4],[86,2,86,6],[87,2,87,6],[88,2,88,6],[131,2,131,6],[114,2,114,6],[115,2,115,6],[116,2,116,6],[117,2,117,6],[118,2,118,6],[119,2,119,6],[120,2,120,6],[121,2,121,6],[122,2,122,6],[125,2,125,6],[126,2,126,6],[127,2,127,6],[128,2,128,6],[130,2,130,6],[129,2,129,6],[133,2,133,6],[134,2,134,6],[135,2,135,6],[136,2,136,6],[157,2,157,6],[153,2,153,6],[154,2,154,6],[155,2,155,6],[156,2,156,6],[147,2,147,6],[148,2,148,6],[137,2,137,6],[138,2,138,6],[139,2,139,6],[140,2,140,6],[141,2,141,6],[142,2,142,6],[376,2,376,4],[194,2,194,6],[195,2,195,6],[196,2,196,6],[197,2,197,6],[222,2,222,8],[223,2,223,8],[232,2,232,5],[268,2,268,5],[219,2,219,4],[375,2,375,4],[358,2,358,5],[373,2,373,7],[374,2,374,4],[233,2,233,5],[234,2,234,5],[230,2,230,5],[224,2,224,5],[224,7,224,8],[202,5,202,6],[200,2,200,6],[231,2,231,5],[311,2,311,5],[312,2,312,5],[199,2,199,6],[165,2,165,6],[149,2,149,6],[150,2,150,6],[151,2,151,6],[152,2,152,6],[169,2,169,6],[160,2,160,6],[163,2,163,6],[164,2,164,6],[161,2,161,6],[162,2,162,6],[159,2,159,6],[177,2,177,6],[166,2,166,6],[167,2,167,6],[168,2,168,6],[178,2,178,6],[188,2,188,6],[181,2,181,6],[158,2,158,6],[182,2,182,6],[170,2,170,6],[176,2,176,6],[180,2,180,6],[171,2,171,6],[174,2,174,6],[198,2,198,6],[186,2,186,6],[187,2,187,6],[190,2,190,6],[191,2,191,6],[179,2,179,6],[189,2,189,6],[183,2,183,6],[184,2,184,6],[185,2,185,6],[192,2,192,6],[193,2,193,6],[172,2,172,6],[173,2,173,6],[175,2,175,6],[0,19,1,19],[0,21,1,21],[38,2,38,4],[38,5,38,8],[45,2,45,5],[0,12,1,12],[10,6,10,7],[0,33,1,33],[0,34,1,34],[12,6,12,8],[0,30,1,30],[0,31,1,31],[0,22,1,22],[0,24,1,24],[0,25,1,25],[0,17,1,17],[0,14,1,14],[0,13,1,13],[0,11,4,11],[0,10,4,10],[3,5,3,8],[6,2,6,4],[10,2,10,4],[0,15,1,15]]}
[null,null,null,"Ministero dello\nSviluppo economico",null,null,null,null,null,null,"check compilazione","check coerenza","Progetto salvato","imprese sing.le/ ass.te condiz.ti","valori si/no condiz.ti","Messaggio per PMI",null,"Anno_Domanda",null,"Esercizi_Chiusi",null,"Durata_PJ_Minima","Durata_PJ_Massima",null,"QUOTA_AERONAUTICA_Grande","QUOTA_AERONAUTICA_Piccola_Media",null,"Min_PMI_Associate",null,null,"Durata_RESTITUZIONE_Minima","Durata_RESTITUZIONE_Massima",null,"Sviluppo_RESTITUZIONI","BONUS_a8c2"]
[null,null,null,null,null,{"$f":"MENU!B5","v":"Direzione generale per la politica industriale, la competitività e le PMI"}]
[]
[null,null,null,null,null,{"$f":"MENU!B7","v":"Divisione IX “Industrie aerospazio,  difesa e sicurezza”"},null,null,null,null,null,null,null,{"$f":"IF($E$9<>\"\",\"Impresa singola\",\"\")","v":"Impresa singola"},{"$f":"IF(AND($E$9<>\"\",$G$9=\"Imprese associate\"),\"Si\",\"\")","v":""},"Si ricorda che, in caso di Piccola o Media Impresa, è necessario sottoscrivere ed allegare alla documentazione da inviare la Dichiarazione sostitutiva ai sensi dell'art. 47 D.P.R. 445/2000, scaricabile nella stessa pagina del sito web del Ministero dove sono scaricabili i presenti moduli.",null,2019,null,{"$f":"ANNO_DOMANDA-2","v":2017},null,24,60,null,0.6,0.25,null,2,2,null,5,10,null,{"$f":"Durata_RESTITUZIONE_Minima","v":5},{"$f":"(Durata_RESTITUZIONE_Massima-AH4)*3%","v":0.15}]
[null,null,"Torna al menu principale",null,null,"DOMANDA DI ACCESSO AI PROGETTI DI RICERCA E SVILUPPO EX. L. 808/85\n- ALLEGATO A: Dati generali impresa proponente -",null,null,null,null,null,null,null,{"$f":"IF($E$9<>\"\",\"Imprese associate\",\"\")","v":"Imprese associate"},{"$f":"IF(AND($E$9<>\"\",$G$9=\"Imprese associate\"),\"No\",\"\")","v":""},null,null,null,null,{"$f":"T4+1","v":2018},null,null,null,null,null,null,null,3,2,null,null,null,null,{"$f":"AH4+1","v":6},0.12]
[null,null,null,null,null,null,null,null,null,null,null,null,null,null,null,null,null,null,null,null,null,null,null,null,null,null,null,4,3,null,null,null,null,{"$f":"AH5+1","v":7},0.09]
["X",null,"Legge 808/85 – Progetto\n(max. 80 caratteri):",null,null,null,null,null,"Civile",null,{"$f":"IF(AND(F7=\"\",A7<>\"\"),C7&\" \",\"\") & IF(AND(I7=\"\",A9<>\"\"),\" - \"& H7&\" \n\",\"\")","v":"Legge 808/85 – Progetto\n(max. 80 caratteri): "},null,null,null,null,null,null,null,null,null,null,null,null,null,null,null,null,5,3,null,null,null,null,{"$f":"AH6+1","v":8},0.06]
[null,null,null,null,null,null,null,null,null,null,null,null,null,null,null,null,null,null,null,null,null,null,null,null,null,null,null,null,null,null,null,null,null,{"$f":"AH7+1","v":9},0.03]
["X",null,"Il progetto in oggetto è già stato finanziato per altre annualità dalla L.808/85?",null,"No","Il progetto è presentato da:",null,"La presente impresa è la capofila?",null,null,{"$f":"IF(AND(E9=\"\",A9<>\"\"),\" - \"& C9&\" \n\",\"\") &IF(AND(G9=\"\",A9<>\"\",E9=\"No\"),\" - \"& F9&\" \n\",\"\") &IF(AND(I9=\"\",A9<>\"\",E9=\"No\",G9=\"Imprese associate\"),\" - \"& H9&\" \n\",\"\")","v":" - Il progetto è presentato da: \n"},null,null,null,null,null,null,null,null,null,null,null,null,null,null,null,null,null,null,null,null,null,null,{"$f":"AH8+1","v":10},0]
[]
["X",null,"ULTIMO ESERCIZIO CONTABILE CHIUSO",null,null,null,"DURATA DEL PIANO DELLE  RESTITUZIONI (Art. 8 Comma 2 del bando)",null,null,null,{"$f":"IF(AND(F11=\"\",A11<>\"\"),\" - \"& C11&\" \n\",\"\")","v":" - ULTIMO ESERCIZIO CONTABILE CHIUSO \n"}]
["X",null,null,null,null,null,null,null,null,null,{"$f":"IF(AND(I11=\"\",A12<>\"\"),\" - \"& G11&\" \n\",\"\")","v":" - DURATA DEL PIANO DELLE  RESTITUZIONI (Art. 8 Comma 2 del bando) \n"}]
["X",null,"DIMENSIONE DELL'IMPRESA",null,null,null,{"$f":"IF(I11=\"\",\"\",\"L’importo da rimborsare sarà ulteriormente ridotto del  \"&VLOOKUP(I11,RESTITUZIONI_BONUS,2,0)*100&\"%\")","v":""},null,null,null,{"$f":"IF(AND(F13=\"\",A13<>\"\"),\" - \"& C13&\" \n\",\"\")","v":" - DIMENSIONE DELL'IMPRESA \n"}]
[]
[null,null,"DURATA PROGETTO",null,null,"1-Inizio","2-Fine"]
[null,null,{"$f":"\"a-Anno (Es. \"&ANNO_DOMANDA&\")\"","v":"a-Anno (Es. 2019)"}]
["X",null,"b-Mese (Es. 6)",null,null,null,null,null,null,null,{"$f":"IF(AND(OR(F16=\"\",F17=\"\",G16=\"\",G17=\"\"),A17<>\"\"),\" - \"& C15&\" \n\",\"\")","v":" - DURATA PROGETTO \n"},{"$f":"IF(A17<>\"\",IF(OR(F16=\"\",F17=\"\",G16=\"\",G17=\"\")=FALSE,CONCATENATE(M17,N17),\"\"),\"\")","v":""},{"$f":"IFERROR(IF((EOMONTH(DATE(G16,G17,1),0)>=EOMONTH(DATE(F16,F17,1),Durata_PJ_Minima-1))=TRUE,\"\",\"LA DURATA DEL PROGETTO E' INFERIORE ALLA MINIMA\"),\"\")","v":""},{"$f":"IFERROR(IF((EOMONTH(DATE(G16,G17,1),0)<=EOMONTH(DATE(F16,F17,1),Durata_PJ_Massima-1))=TRUE,\"\",\"LA DURATA DEL PROGETTO E' SUPERIORE ALLA MASSIMA\"),\"\")","v":""}]
[]
[null,null,null,null,null,"DURATA IN MESI"]
[null,null,{"$f":"\"Inserire i dati di durata del Progetto (che deve avere una durata minima di \"&Durata_PJ_Minima&\" mesi e massima di \"&Durata_PJ_Massima&\" mesi) in quest'ordine:\n1. INIZIO (a. Anno b. Mese)    2. FINE (a. Anno b. Mese)\nPer modificare prima svuotare tutte le celle Anno e Mese.\"","v":"Inserire i dati di durata del Progetto (che deve avere una durata minima di 24 mesi e massima di 60 mesi) in quest'ordine:\n1. INIZIO (a. Anno b. Mese)    2. FINE (a. Anno b. Mese)\nPer modificare prima svuotare tutte le celle Anno e Mese."}]
[]
[]
[]
[]
[]
[]
[]
[]
[]
[]
[]
[]
[]
[]
[]
[]
[]
[null,null,"IMPRESA PROPONENTE"]
["X",null,"DENOMINAZIONE",null,null,null,null,null,null,null,{"$f":"IF(AND(F39=\"\",A39<>\"\"),\" - \"& C39&\" \n\",\"\")","v":" - DENOMINAZIONE \n"}]
["X",null,"SEDE LEGALE",null,null,null,null,null,null,null," - SEDE LEGALE \n"]
[null,null,"DIMENSIONE DELL'IMPRESA (Piccola, Media, Grande)",null,null,{"$f":"F13","v":0},null,null,null,null,""]
["X",null,"ISCRIZIONE CCIAA",null,null,null,null,null,null,null," - ISCRIZIONE CCIAA \n"]
["X",null,"ISCRIZIONE INPS",null,null,null,null,null,null,null," - ISCRIZIONE INPS \n"]
["X",null,"CAPITALE SOCIALE (euro)",null,null,null,null,null,null,null," - CAPITALE SOCIALE (euro) \n"]
[]
[null,null,"ELENCO IMPRESE ASSOCIATE E COSTI PROGETTUALI: da compilarsi a cura della capofila",null,null,null,{"$f":"C13","v":"DIMENSIONE DELL'IMPRESA"},"COSTO PER IMPRESA (Importi in migliaia Euro)"]
[null,null,{"$f":"F39","v":0},null,null,null,{"$f":"F13","v":0},{"$f":"ALL_C!T22","v":0}]
[]
[null,null,null,null,null,null,null,null,null,null,null,{"$f":"IF(AND(COUNTA($C$47:$F$51)<2,I9=\"Si\"),\" - \"& \"La capofila deve compilare l'elenco delle imprese associate.\" &\" \n\",\"\")","v":""}]
[null,null,null,null,null,null,null,null,null,null,null,{"$f":"IF(AND(OR(COUNTA($C$48:$F$51)<>COUNTA($G$48:$G$51),COUNTA($G$47:$G$51)<2),I9=\"Si\"),\n\" - \"&\"La capofila deve inserire la dimensione delle imprese associate.\"&\"\n \",\"\")","v":""}]
[null,null,null,null,null,null,null,null,null,null,null,{"$f":"IF(\nAND(COUNTA($G$47:$G$51)>=2,I9=\"Si\",IFERROR(VLOOKUP(COUNTA($G$47:$G$51),Min_PMI_Associate,2,0),0)>(COUNTIF($G$47:$G$51,\"Piccola\")+COUNTIF($G$47:$G$51,\"Media\"))),\n\" - \"&\"Le PMI devono essere almeno il 60%.\"&\" \n\",\"\")","v":""}]
[]
[null,null,"COSTO TOTALE DEL PROGRAMMA",null,null,null,null,{"$f":"SUM(H47:H51)","v":0},null,null,null,{"$f":"IF(AND(SUM($H$48:$H$51)=0,I9=\"Si\"),\" - \"& \"La capofila deve inserire i costi delle imprese associate.\" &\" \n\",\"\")","v":""}]
[]
[null,null,"SOCI  E RELATIVE QUOTE (%)",null,null,null,null,null,null,null,null,{"$f":"IF(I9=\"Si\",ALL_C!X23,\"\")","v":""}]
[null,null,"SOCIO",null,null,null,null,"(%)",null,null,null,{"$f":"IF(I9=\"Si\",ALL_C!X22,\"\")","v":""}]
[]
[]
[]
[]
[]
[]
[]
[]
[]
[]
[]
[]
[]
[]
[]
[]
[]
[]
[]
[]
[]
[]
[]
[]
[]
[]
[]
[]
[]
[]
[]
[]
[]
[]
[]
[]
[]
[]
[]
[]
[]
[]
[]
[]
[]
[]
[]
[]
[]
[]
[]
[]
[]
[]
[]
[]
[]
[]
[]
[]
[]
[]
[]
[]
[]
[]
[]
[]
[]
[]
[]
[]
[]
[]
[]
[]
[]
[]
[]
[]
[]
[]
[]
[]
[]
[]
[]
[]
[]
[]
[]
[]
[]
[]
[]
[]
[]
[]
[]
[]
[]
[]
[]
[]
[]
[]
[]
[]
[]
[]
[]
[]
[]
[]
[]
[]
[]
[]
[]
[]
[]
[]
[]
[]
[]
[]
[]
[]
[]
[]
[]
[]
[]
[]
[]
[]
[]
[]
[]
[]
[]
[]
[]
[]
[]
[]
["X",null,null,null,null,"TOTALE QUOTE CAPITALE SOCIALE:",null,{"$f":"SUM(H57:H202)","v":0},null,null,{"$f":"IF(AND(H203=0,A203<>\"\"),\" - \" & C55&\" \n\",\"\")","v":" - SOCI  E RELATIVE QUOTE (%) \n"}]
[]
[null,null,"UNITA' PRODUTTIVE"]
["X",null,"ATTIVITÀ (principali attività produttive dell’azienda)",null,null,null,null,null,null,null,{"$f":"IF(AND(F206=\"\",A206<>\"\"),\" - \"& C206&\" \n\",\"\")","v":" - ATTIVITÀ (principali attività produttive dell’azienda) \n"}]
["X",null,"STABILIMENTI DI PRODUZIONE  (ubicazione e principali linee di produzione)",null,null,null,null,null,null,null,{"$f":"IF(AND(F207=\"\",A207<>\"\"),\" - \"& C207&\" \n\",\"\")","v":" - STABILIMENTI DI PRODUZIONE  (ubicazione e principali linee di produzione) \n"}]
[]
[null,null,"PERSONALE (N° ADDETTI al 31 dicembre)"]
[null,null,"(N° ADDETTI)",null,null,{"$f":"ANNO_DOMANDA-2","v":2017},{"$f":"F210+1","v":2018},{"$f":"G210+1","v":2019}]
[null,null,"DIRIGENTI",null,null,null,null,null,null,null,{"$f":"IF(AND(SUM(F211:H211)=0,A211<>\"\"),C211&\" \",\"\")","v":""}]
[null,null,"IMPIEGATI",null,null,null,null,null,null,null,{"$f":"IF(AND(SUM(F212:H212)=0,A212<>\"\"),C212&\" \",\"\")","v":""}]
[null,null,"OPERAI",null,null,null,null,null,null,null,{"$f":"IF(AND(SUM(F213:H213)=0,A213<>\"\"),C213&\" \",\"\")","v":""}]
["X",null,"TOTALE ADDETTI",null,null,{"$f":"SUM(F211:F213)","v":0},{"$f":"SUM(G211:G213)","v":0},{"$f":"SUM(H211:H213)","v":0},null,null,{"$f":"IF(AND(SUM(F214:H214)=0,A214<>\"\"),\" - \"& C209&\" \n\",\"\")","v":" - PERSONALE (N° ADDETTI al 31 dicembre) \n"},{"$f":"IF(OR(F214<>I219,G214<>I220,H214<>I221),\" - Addetti per tipologia di contratto non coerenti con addetti per livello di istruzione I219\n\",\"\")","v":""}]
[null,null," di cui CIG (in numero equivalente di addetti)",null,null,null,null,null,null,null,{"$f":"IF(AND(SUM(F215:H215)=0,A240<>\"\"),C215&\" \",\"\")","v":""},{"$f":"IF(OR(F215>(F212+F213),G215>(G212+G213),H215>(H212+H213)),\" - Addetti in CIG non coerenti con operai e impiegati\n\",\"\")","v":""}]
["X",null,"di cui RICERCATORI/TECNICI",null,null,null,null,null,null,null,{"$f":"IF(AND(SUM(F216:H216)=0,A216<>\"\"),\" - \"& C216&\" \n\",\"\")","v":" - di cui RICERCATORI/TECNICI \n"},{"$f":"IF(OR(F216>(F212+F211),G216>(G212+G211),H216>(H212+H211)),\" - Ricercatori/Tecninci non coerenti con dirigenti e impiegati\n\",\"\")","v":""}]
[]
[null,null,"PERSONALE",null,null,"LAUREATI","DIPLOMATI","ALTRI","TOTALE"]
[null,null,{"$f":"$F$210","v":2017},null,null,null,null,{"$f":"F214-SUM(F219:G219)","v":0},{"$f":"SUM(F219:H219)","v":0},null,null,{"$f":"IF(H219<0,\" - Numero di addetti negativo sulla voce Altro per l'anno \"&C219 & \" \n\",\"\")","v":""}]
[null,null,{"$f":"C219+1","v":2018},null,null,null,null,{"$f":"G214-SUM(F220:G220)","v":0},{"$f":"SUM(F220:H220)","v":0},null,null,{"$f":"IF(H220<0,\" - Numero di addetti negativo sulla voce Altro per l'anno \"&C220 & \" \n\",\"\")","v":""}]
[null,null,{"$f":"C220+1","v":2019},null,null,null,null,{"$f":"H214-SUM(F221:G221)","v":0},{"$f":"SUM(F221:H221)","v":0},null,null,{"$f":"IF(H221<0,\" - Numero di addetti negativo sulla voce Altro per l'anno \"&C221 & \" \n\",\"\")","v":""}]
[]
[null,null,"PRINCIPALI PARTECIPAZIONI DELLA PROPONENTE"]
[null,null,"(QUOTE DI PARTECIPAZIONE E SETTORI DI ATTIVITÀ DELLE PARTECIPATE )"]
[null,null,"PARTECIPATE",null,null,null,"(%)","SETTORE DI ATTIVITA'"]
[]
[]
[]
[]
[]
[]
[]
[]
[]
[]
[]
[]
[]
[]
[]
[]
[]
[]
[]
[]
[]
[]
[]
[]
[]
[]
[]
[]
[]
[]
[]
[]
[]
[]
[]
[]
[]
[]
[]
[]
[]
[]
[]
[]
[]
[]
[]
[]
[]
[]
[]
[]
[]
[]
[]
[]
[]
[]
[]
[]
[]
[]
[]
[]
[]
[]
[]
[]
[]
[]
[]
[]
[]
[]
[]
[]
[]
[]
[]
[]
[]
[]
[]
[]
[]
[]
[]
[]
[]
[]
[]
[]
[]
[]
[]
[]
[]
[]
[]
[]
[]
[]
[]
[]
[]
[]
[]
[]
[]
[]
[]
[]
[]
[]
[]
[]
[]
[]
[]
[]
[]
[]
[]
[]
[]
[]
[]
[]
[]
[]
[]
[]
[]
[]
[]
[]
[]
[]
[]
[]
[]
[]
[]
[]
[]
[]
[]
[]
[null,null,"FATTURATO",null,null,null,null,null,"ALL. A.1: EL. PATR."]
[null,null,"(IMPORTI IN MIGLIAIA DI EURO)",null,null,{"$f":"$F$210","v":2017},{"$f":"(F375+1)","v":2018},{"$f":"F375+2 & \"\n(previsionale)\"","v":"2019\n(previsionale)"},"ALL. A.2: EL. ECON."]
[null,null,"FATTURATO",null,null,{"$f":"IF($F$11=\"\",0,IF($F$11=F375,ALL_A.2!$H$16,ALL_A.2!$F$16))/1000","v":0},{"$f":"IF($F$11=\"\",0,IF($F$11=G382,ALL_A.2!$H$16/1000,\"\"))","v":0}]
[null,null,"FATTURATO CALCOLATO",null,null,{"$f":"F376","v":0},{"$f":"IF(G376=\"\",0,G376)","v":0},{"$f":"H376","v":0}]
["X",null,"QUOTA % DI COSTRUZIONI AERONAUTICHE SUL TOTALE",null,null,null,null,null,null,null,{"$f":"IF(AND(SUM(F378:H378)=0,A378<>\"\"), \" - \" & C378&\"\n \",\"\")","v":" - QUOTA % DI COSTRUZIONI AERONAUTICHE SUL TOTALE\n "},{"$f":"IF(F13=\"\",\"\",\nIF(F13=\"Grande\",\nIF((F378+G378)/2<QUOTA_AERONAUTICA_Grande,\" - \"&C378&\" incoerente con le dimensioni dell'impresa\",\"\"),\nIF((F378+G378)/2<QUOTA_AERONAUTICA_Piccola_Media,\" - \"&C378&\" incoerente con le dimensioni dell'impresa\",\"\")\n)\n)","v":""},{"$f":"IF(G41=\"\",\"\",1)","v":""}]
[null,null,"FATTURATO PER ADDETTO",null,null,{"$f":"IF(F214=0,0,F377/F214)","v":0},{"$f":"IF(G214=0,0,G377/G214)","v":0},{"$f":"IF(H214=0,0,H377/H214)","v":0}]
[]
[null,null,"INCIDENZA ESPORTAZIONI"]
[null,null,"(VALORE %)",null,null,{"$f":"F$375","v":2017},{"$f":"F$382+1","v":2018},{"$f":"H$375","v":"2019\n(previsionale)"}]
[null,null,"% SU TOTALE FATTURATO",null,null,null,null,null,null,null,{"$f":"IF(AND(SUM(F383:H383)=0,A383<>\"\"), \" - \" & C381&\"\n \",\"\")","v":""}]
[]
[null,null,"INVESTIMENTI"]
[null,null,"(IMPORTI IN MIGLIAIA DI EURO)",null,null,{"$f":"F$375","v":2017},{"$f":"F$382+1","v":2018},{"$f":"H$375","v":"2019\n(previsionale)"}]
[null,null,"FABBRICATI INDUSTRIALI E TERRENI"]
[null,null,"MACCHINARI, IMPIANTI E ATTREZZATURE DI PRODUZIONE"]
[null,null,"TOTALE",null,null,{"$f":"SUM(F387:F388)","v":0},{"$f":"SUM(G387:G388)","v":0},{"$f":"SUM(H387:H388)","v":0},null,null,{"$f":"IF(AND(SUM(F389:H389)=0,A389<>\"\"),C389&\" \",\"\")","v":""}]
[]
[null,null,"ATTIVITÀ DI RICERCA E SVILUPPO"]
[null,null,"(IMPORTI IN MIGLIAIA DI EURO)",null,null,{"$f":"F$375","v":2017},{"$f":"F$382+1","v":2018},{"$f":"H$375","v":"2019\n(previsionale)"}]
[null,null,"INVESTIMENTI R&S (Valori assoluti)",null,null,null,null,null,null,null,{"$f":"IF(AND(SUM(F393:H393)=0,A393<>\"\"),C393&\" \",\"\")","v":""}]
[null,null,"% SU FATTURATO",null,null,{"$f":"IF(F377=0,0,F393/F377)","v":0},{"$f":"IF(G377=0,0,G393/G377)","v":0},{"$f":"IF(H377=0,0,H393/H377)","v":0}]
[]
[null,null,"PREVISIONE PROSSIMI TRE ESERCIZI "]
[null,null,"(IMPORTI IN MIGLIAIA DI EURO)",null,null,{"$f":"F$375+2","v":2019},{"$f":"F397+1","v":2020},{"$f":"G397+1","v":2021}]
["A",null,"INVESTIMENTI TOTALI",null,null,{"$f":"H389","v":0}]
["A",null,"RICERCA E SVILUPPO",null,null,{"$f":"H393","v":0}]
["A",null,"ORDINI"]
[]
[null,null,"ALLEGATO A.1: ELEMENTI PATRIMONIALI",null,null,null,null,null,null,null,{"$f":"CONCATENATE(K7,K9,K11,K12,K13,K17,K39,K40,K41,K42,K43,K44,K203,K206,K207,K211,K212,K213,K214,K215,K216,K373,K383,K389,K393)","v":"Legge 808/85 – Progetto\n(max. 80 caratteri):  - Il progetto è presentato da: \n - ULTIMO ESERCIZIO CONTABILE CHIUSO \n - DURATA DEL PIANO DELLE  RESTITUZIONI (Art. 8 Comma 2 del bando) \n - DIMENSIONE DELL'IMPRESA \n - DURATA PROGETTO \n - DENOMINAZIONE \n - SEDE LEGALE \n - ISCRIZIONE CCIAA \n - ISCRIZIONE INPS \n - CAPITALE SOCIALE (euro) \n - SOCI  E RELATIVE QUOTE (%) \n - ATTIVITÀ (principali attività produttive dell’azienda) \n - STABILIMENTI DI PRODUZIONE  (ubicazione e principali linee di produzione) \n - PERSONALE (N° ADDETTI al 31 dicembre) \n - di cui RICERCATORI/TECNICI \n"},{"$f":"CONCATENATE(L17,L49,L50,L51,L53,L55,L56,L214,L215,L216,L219,L220,L221,L378)","v":""}]
[null,null,"ALLEGATO A.2: ELEMENTI DEL CONTO ECONOMICO"]

{"sheet":"ALL_A.1","index":4,"n_rows":58,"n_cols":13,"rows_kept":58,"cut":false,"hidden":true,"merged":[[0,12,4,12],[0,2,3,2],[19,2,19,4],[19,7,19,9],[10,3,10,4],[8,2,8,9],[6,3,6,7],[0,11,4,11],[1,3,1,9],[3,3,3,9],[4,3,4,9],[0,3,0,9],[2,3,2,9],[10,2,11,2],[10,7,11,7],[10,8,10,9]]}
[null,null,"Ministero dello\nSviluppo economico",null,null,null,null,null,null,null,null,"check compilazione","check coerenza"]
[null,null,null,{"$f":"MENU!B5","v":"Direzione generale per la politica industriale, la competitività e le PMI"}]
[]
[null,null,null,{"$f":"MENU!B7","v":"Divisione IX “Industrie aerospazio,  difesa e sicurezza”"}]
[null,null,"Torna al menu principale","DOMANDA DI ACCESSO AI PROGETTI DI RICERCA E SVILUPPO EX. L. 808/85\n- ALLEGATO A.1: Elementi Patrimoniali -"]
[]
[null,null,"Legge 808/85 –  PROGETTO:",{"$f":"IF(ALL_A!$F$7=0,\"\",ALL_A!$F$7)","v":""},null,null,null,null,"Area:",{"$f":"ALL_A!$I$7","v":"Civile"}]
[]
[null,null,"(Importi in euro)"]
[]
[null,null,"ELEMENTI DELL'ATTIVO",{"$f":"IF(D12=\"\",\"Attenzione: indicare ultimo esercizio chiuso in All. A\",\"ESERCIZIO\")","v":"Attenzione: indicare ultimo esercizio chiuso in All. A"},null,null,null,"ELEMENTI DEL PASSIVO",{"$f":"D11","v":"Attenzione: indicare ultimo esercizio chiuso in All. A"}]
[null,null,null,{"$f":"IF(ALL_A!$F$11=\"\",\"\",ALL_A!$F$11-1)","v":""},{"$f":"IF(D12=\"\",\"\",D12+1)","v":""},null,null,null,{"$f":"D12","v":""},{"$f":"E12","v":""}]
[null,"A)",null,null,null,null,"A)"]
[101,"B)","CREDITI VERSO SOCI PER VERSAMENTI ANCORA DOVUTI",null,null,131,null,"PATRIMONIO NETTO"]
[null,"I"]
[105,"II","IMMOBILIZZAZIONI",null,null,132,null,"FONDI RISCHI E ONERI"]
[null,"III"]
[111,null,"RIMANENZE",null,null,133,null,"TRATTAMENTO DI FINE RAPPORTO"]
[]
[null,"C)","CREDITI",null,null,null,"B)","DEBITI"]
[112,"I","verso Clienti",null,null,134,null,"Obbligazioni e obbligazioni convertibili"]
[113,1,"di cui oltre l'esercizio successivo",null,null,135,"C)","di cui oltre l'esercizio successivo"]
[114,2,"verso altri\n(esclusi quelli vs. clienti)",null,null,136,null,"Debiti verso banche"]
[115,3,"di cui oltre l'esercizio successivo",null,null,137,"D)","di cui oltre l'esercizio successivo"]
[null,4,"TOTALE CREDITI",{"$f":"SUM(D21,D23)","v":0},{"$f":"SUM(E21,E23)","v":0},138,"1-2","Debiti verso altri finanziatori"]
[null,5,null,null,null,139,null,"di cui oltre l'esercizio successivo"]
[null,null,null,null,null,142,4,"Debiti verso fornitori"]
[null,"II",null,null,null,143,null,"Debiti tributari e verso istituti di previdenza e sicurezza sociale"]
[null,1,null,null,null,144,5,"Altri debiti"]
[null,null,null,null,null,145,null,"di cui oltre l'esercizio successivo"]
[null,"2-3-4-5",null,null,null,null,6,"TOTALE DEBITI",{"$f":"SUM(I21,I23,I25,I27,I28,I29)","v":0},{"$f":"SUM(J21,J23,J25,J27,J28,J29)","v":0}]
[]
[null,null,null,null,null,null,7]
[null,"III"]
[null,6]
[]
[null,"IV"]
[null,1]
[null,2,null,null,null,null,"E)"]
[null,3]
[]
[]
[]
[null,"D)"]
[]
[null,null,null,{"$f":"SUM(D14:D31)","v":0},{"$f":"SUM(E14:E31)","v":0},null,null,null,{"$f":"SUM(I14:I31)","v":0},{"$f":"SUM(J14:J31)","v":0},null,{"$f":"IF(AND(D58>0,E58>0,I58>0,J58>0),\"\",\"-Elementi Patrimoniali da compilare\")","v":"-Elementi Patrimoniali da compilare"}]
[]
[]
[]
[null,null,null,{"$f":"AND(D31>0,E31>0,I31>0,J31>0)","v":false},null,null,null,null,null,null,null,null,{"$f":"IF(OR(I50<>0,J50<>0),\" - Squadratura Stato Patrimoniale \n\",\"\")","v":""}]
[]
[null,null,null,null,null,null,null,null,null,null,null,{"$f":"CONCATENATE(L46)","v":"-Elementi Patrimoniali da compilare"},{"$f":"CONCATENATE(M50)","v":""}]
[]
[]
[]
[]
[]
[null,null,null,{"$f":"D14+D16+D18+D25","v":0},{"$f":"E14+E16+E18+E25","v":0},null,null,null,{"$f":"I14+I16+I18+I31","v":0},{"$f":"J14+J16+J18+J31","v":0}]

{"sheet":"ALL_A.2","index":5,"n_rows":56,"n_cols":12,"rows_kept":56,"cut":false,"hidden":true,"merged":[[38,2,38,4],[30,2,30,4],[32,2,32,4],[3,3,3,8],[19,2,19,4],[36,2,36,4],[24,2,24,4],[34,2,34,4],[0,2,3,2],[14,2,14,7],[29,2,29,4],[21,2,21,7],[25,2,25,4],[17,2,17,4],[0,11,4,11],[0,10,4,10],[9,2,9,8],[11,5,11,8],[15,2,15,4],[11,2,12,4],[4,3,4,8],[6,3,6,5],[0,3,0,8],[1,3,1,8]]}
[null,null,"Ministero dello\nSviluppo economico",null,null,null,null,null,null,null,"check compilazione","check coerenza"]
[null,null,null,{"$f":"MENU!B5","v":"Direzione generale per la politica industriale, la competitività e le PMI"}]
[]
[null,null,null,{"$f":"MENU!B7","v":"Divisione IX “Industrie aerospazio,  difesa e sicurezza”"}]
[null,null,"Torna al menu principale","DOMANDA DI ACCESSO AI PROGETTI DI RICERCA E SVILUPPO EX. L. 808/85\n- ALLEGATO A.2: Elementi del Conto Economico -"]
[]
[null,null,"Legge 808/85 –  PROGETTO:",{"$f":"IF(ALL_A!$F$7=0,\"\",ALL_A!$F$7)","v":""},null,null,"Area:",{"$f":"ALL_A!$I$7","v":"Civile"}]
[]
[]
[null,null,"(Importi in euro)"]
[]
[null,null,"ELEMENTI DEL CONTO ECONOMICO",null,null,{"$f":"ALL_A.1!D11","v":"Attenzione: indicare ultimo esercizio chiuso in All. A"}]
[null,null,null,null,null,{"$f":"ALL_A.1!D12","v":""},null,{"$f":"ALL_A.1!E12","v":""}]
[null,"A)"]
[null,1,"RICAVI"]
[149,2,"Ricavi delle vendite e delle prestazioni"]
[153,3,"Altri ricavi e proventi"]
[null,4,"TOTALE RICAVI",null,null,{"$f":"SUM(F16:F17)","v":0},null,{"$f":"SUM(H16:H17)","v":0}]
[]
[154,null,"VALORE DELLA PRODUZIONE"]
[null,5]
[null,null,"COSTI DELLA PRODUZIONE",null,null,null,null,null,null,null,{"$f":"IF(OR(F56<>0,H56<>0),\"\",\" - Elementi del Conto Economico da compilare \n\")","v":" - Elementi del Conto Economico da compilare \n"}]
[155,"B)","per Materie prime, di consumo e di merci"]
[156,6,"per Servizi"]
[180,7,"di cui Utenze"]
[181,"7.1","di cui Manutenzioni"]
[157,"7.2","per Godimento beni di terzi"]
[158,8,"per il Personale"]
[159,9,"Ammortamenti e svalutazioni"]
[160,10,"Variaz. rimanenze di materie, sussidiarie, di consumo e di merci"]
[null,11,"TOTALE COSTI DELLA PRODUZIONE CONSIDERATI",null,null,{"$f":"SUM(F27:F30)+F24+F23","v":0},null,{"$f":"SUM(H27:H30)+H24+H23","v":0}]
[null,12]
[170,13,{"$f":"UPPER(\"Totale Proventi (+) e Oneri (-) Finanziari\")","v":"TOTALE PROVENTI (+) E ONERI (-) FINANZIARI"}]
[null,14]
[176,null,{"$f":"UPPER(\"Totale Proventi (+) e Oneri (-) Straordinari\")","v":"TOTALE PROVENTI (+) E ONERI (-) STRAORDINARI"}]
[]
[178,"C)","IMPOSTE SUL REDDITO DELL'ESERCIZIO"]
[null,15]
[179,16,"UTILE / PERDITA D'ESERCIZIO"]
[null,17]
[null,"17bis"]
[]
[null,"D)"]
[null,18]
[null,19]
[]
[null,"E)"]
[null,20]
[null,21]
[]
[]
[null,22]
[null,23]
[]
[]
[null,null,null,null,null,{"$f":"F18+F20+F31+F33+F35+F37+F39","v":0},null,{"$f":"H18+H20+H31+H33+H35+H37+H39","v":0},null,null,{"$f":"CONCATENATE(K22)","v":" - Elementi del Conto Economico da compilare \n"}]

{"sheet":"ALL_C","index":6,"n_rows":581,"n_cols":30,"rows_kept":581,"cut":false,"hidden":true,"merged":[[517,2,517,19],[4,3,4,19],[32,2,32,19],[30,2,30,19],[50,2,50,19],[6,4,6,10],[49,2,49,18],[58,2,58,18],[41,2,41,18],[120,2,120,19],[174,2,174,19],[66,2,66,19],[463,2,463,19],[231,2,232,19],[234,2,234,19],[62,2,62,19],[0,24,4,24],[31,2,31,18],[0,22,4,22],[0,23,4,23],[0,21,4,21],[12,16,12,19],[23,2,23,19],[0,2,3,2],[0,3,0,19],[1,3,1,19],[3,3,3,19],[238,2,238,19],[292,2,292,19],[40,2,40,18],[346,2,346,19],[409,2,409,19]]}
[null,null,"Ministero dello\nSviluppo economico",null,null,null,null,null,null,null,null,null,null,null,null,null,null,null,null,null,null,"fin.to L. 808/85","check compilazione","check coerenza","% Maggiorazione costo pers.le",null,"Singola","Capofila","Associata"]
[null,null,null,{"$f":"MENU!B5","v":"Direzione generale per la politica industriale, la competitività e le PMI"},null,null,null,null,null,null,null,null,null,null,null,null,null,null,null,null,null,null,null,null,null,null,{"$f":"IF(AND(ALL_A!$G$9=\"Impresa singola\",ALL_A!$I$9=\"\"),1,0)","v":0},{"$f":"IF(AND(ALL_A!$G$9=\"Imprese associate\",ALL_A!$I$9=\"Si\"),1,0)","v":0},{"$f":"IF(AND(ALL_A!$G$9=\"Imprese associate\",ALL_A!$I$9=\"No\"),1,0)","v":0}]
[]
[null,null,null,{"$f":"MENU!B7","v":"Divisione IX “Industrie aerospazio,  difesa e sicurezza”"},null,null,null,null,null,null,null,null,null,null,null,null,null,null,null,null,null,null,null,null,null,null,60000,{"$f":"AA4","v":60000},{"$f":"AB4","v":60000},"Massimo"]
[null,null,"Torna al menu principale","DOMANDA DI ACCESSO AI PROGETTI DI RICERCA E SVILUPPO EX. L. 808/85\n- ALLEGATO C: Previsioni di Costo del progetto -",null,null,null,null,null,null,null,null,null,null,null,null,null,null,null,null,null,null,null,null,null,null,1000,2000,null,"Minimo"]
[]
[null,null,"Legge 808/85 – PROGETTO:",{"$f":"IF(ALL_A!$F$7=0,\"\",ALL_A!$F$7)","v":""},{"$f":"IF(ALL_A!$F$7=0,\"\",ALL_A!$F$7)","v":""},null,null,null,null,null,null,null,null,null,null,null,null,null,"Area:",{"$f":"ALL_A!$I$7","v":"Civile"},null,{"$f":"ALL_A!$E$9","v":"No"}]
[]
[null,null,"Durata progetto",null,"Inizio","Fine"]
[null,null,"Anno:",null,{"$f":"IF(ALL_A!F16=\"\",\"\",ALL_A!F16)","v":""},{"$f":"IF(ALL_A!G16=\"\",\"\",ALL_A!G16)","v":""},null,null,null,null,null,null,null,null,null,null,null,null,null,null,null,null,{"$f":"IF(AND(A10<>\"\",OR(E10=\"\",E11=\"\",F10=\"\",F11=\"\"),A10<>\"\"),\" - \"&C9&\" non definita\"&\" \",\"\")","v":""}]
[null,null,"Mese:",null,{"$f":"IF(ALL_A!F17=\"\",\"\",ALL_A!F17)","v":""},{"$f":"IF(ALL_A!G17=\"\",\"\",ALL_A!G17)","v":""},null,null,null,null,null,null,null,null,null,null,null,null,null,"(Importi in migliaia Euro)"]
[]
[null,null,"C-1) PREVISIONE DEI COSTI DELLE ATTIVITA' (Per tipo di costo)"]
[]
[null,null," TIPO DI COSTO","COSTI CONSUNTIVATI",{"$f":"ALL_A!F16","v":0},{"$f":"E15+1","v":1},{"$f":"F15+1","v":2},3,4,5,6,7,8,9,10,11,12,13,14,"TOTALE\nGENER."]
[null,null,"COSTO DEL PERSONALE",{"$f":"D36+D45+D54","v":0},{"$f":"ALL_C_PERSONALE!F90","v":0},{"$f":"ALL_C_PERSONALE!G90","v":0},{"$f":"ALL_C_PERSONALE!H90","v":0},{"$f":"ALL_C_PERSONALE!I90","v":0},{"$f":"ALL_C_PERSONALE!J90","v":0},{"$f":"ALL_C_PERSONALE!K90","v":0},{"$f":"ALL_C_PERSONALE!L90","v":0},{"$f":"ALL_C_PERSONALE!M90","v":0},{"$f":"ALL_C_PERSONALE!N90","v":0},{"$f":"ALL_C_PERSONALE!O90","v":0},{"$f":"ALL_C_PERSONALE!P90","v":0},{"$f":"ALL_C_PERSONALE!Q90","v":0},{"$f":"ALL_C_PERSONALE!R90","v":0},{"$f":"ALL_C_PERSONALE!S90","v":0},{"$f":"ALL_C_PERSONALE!T90","v":0},{"$f":"SUM(D16:S16)","v":0}]
[null,null,null,null,null,null,null,null,null,null,null,null,null,null,null,null,null,null,null,{"$f":"SUM(D17:S17)","v":0}]
[null,null,null,null,null,null,null,null,null,null,null,null,null,null,null,null,null,null,null,0]
[null,null,"MATERIALI",{"$f":"D37+D46+D55","v":0},0,0,{"$f":"G37+G46+G55","v":0},0,0,0,0,0,0,0,0,0,0,0,0,0]
[null,null,"STRUMENTAZIONE E ATTREZZATURE",0,0,0,{"$f":"G38+G47+G56","v":0},0,0,0,0,0,0,0,0,0,0,0,0,0]
[null,null,"SERVIZI DI CONSULENZA",0,0,0,{"$f":"G39+G48+G57","v":0},0,0,0,0,0,0,0,0,0,0,0,0,0]
[null,null,"TOTALE GENERALE",{"$f":"SUM(D16:D21)","v":0},{"$f":"SUM(E16:E21)","v":0},{"$f":"SUM(F16:F21)","v":0},{"$f":"SUM(G16:G21)","v":0},0,0,0,0,0,0,0,0,0,0,0,0,0,null,null,{"$f":"IF(AND(SUM(T22)=0,A22<>\"\"),\" - \"&C13&\" \n\",\"\")","v":""},{"$f":"IF($A$23<>\"\",CONCATENATE(AA22,AB22,AC22),\"\")","v":""},null,null,{"$f":"IF(AND(AA2=1,AA4<>\"\"),IF(AND(ALL_A!$H$53>(AA4*AA$2),ALL_A!$H$53<>0),\" - COSTI TOTALI DEL PROGETTO SUPERIORI AL MASSIMO CONSENTITO.\"&\"\n \",\"\"),\"\")","v":""},{"$f":"IF(AND(AB2=1,AB4<>\"\"),IF(AND(ALL_A!$H$53>(AB4*AB$2),ALL_A!$H$53<>0),\" - COSTI TOTALI DEL PROGETTO SUPERIORI AL MASSIMO CONSENTITO.\"&\"\n \",\"\"),\"\")","v":""},{"$f":"IF(AND(AC2=1,AC4<>\"\"),IF(AND(ALL_A!$H$53>(AC4*AC$2),ALL_A!$H$53<>0),\" - COSTI TOTALI DEL PROGETTO SUPERIORI AL MASSIMO CONSENTITO.\"&\"\n \",\"\"),\"\")","v":""},{"$f":"AD4","v":"Massimo"}]
["X",null,null,null,null,null,null,null,null,null,null,null,null,null,null,null,null,null,null,null,null,null,null,{"$f":"IF($A$23<>\"\",CONCATENATE(AA23,AB23,AC23),\"\")","v":""},null,null,{"$f":"IF(AND(AA2=1,AA5<>\"\"),IF(AND(ALL_A!$H$53<(AA5*ALL_C!AA$2),ALL_A!$H$53<>0),\" - COSTI TOTALI DEL PROGETTO INFERIORI AL MINIMO CONSENTITO.\"&\"\n \",\"\"),\"\")","v":""},{"$f":"IF(AND(AB2=1,AB5<>\"\"),IF(AND(ALL_A!$H$53<(AB5*ALL_C!AB$2),ALL_A!$H$53<>0),\" - COSTI TOTALI DEL PROGETTO INFERIORI AL MINIMO CONSENTITO.\"&\"\n \",\"\"),\"\")","v":""},{"$f":"IF(AND(AC2=1,AC5<>\"\"),IF(AND(ALL_A!$H$53<(AC5*ALL_C!AC$2),ALL_A!$H$53<>0),\" - COSTI TOTALI DEL PROGETTO INFERIORI AL MINIMO CONSENTITO.\"&\"\n \",\"\"),\"\")","v":""},{"$f":"AD5","v":"Minimo"}]
[null,null,"C-2) PREVISIONE DEI COSTI DELLE ATTIVITA' (Per tipi di attivita') "]
[]
[null,null," TIPO DI COSTO",{"$f":"$D$15","v":"COSTI CONSUNTIVATI"},{"$f":"E$15","v":0},{"$f":"E26+1","v":1},{"$f":"F26+1","v":2},3,4,5,6,7,8,9,10,11,12,13,14,"TOTALE\nGENER."]
[null,null,"STUDI DI FATTIBILITA' TECNICA",{"$f":"D40","v":0},{"$f":"E40","v":0},{"$f":"F40","v":0},{"$f":"G40","v":0},0,0,0,0,0,0,0,0,0,0,0,0,{"$f":"SUM(D27:S27)","v":0},null,null,null,null,null,null,{"$f":"X23","v":""}]
[null,null,"RICERCA INDUSTRIALE ",{"$f":"D49","v":0},{"$f":"E49","v":0},{"$f":"F49","v":0},{"$f":"G49","v":0},0,0,0,0,0,0,0,0,0,0,0,0,{"$f":"SUM(D28:S28)","v":0}]
[null,null,"SVILUPPO SPERIMENTALE  (1)",{"$f":"D58","v":0},{"$f":"E58","v":0},{"$f":"F58","v":0},{"$f":"G58","v":0},0,0,0,0,0,0,0,0,0,0,0,0,{"$f":"SUM(D29:S29)","v":0}]
["X",null,"TOTALE GENERALE",{"$f":"SUM(D27:D29)","v":0},{"$f":"SUM(E27:E29)","v":0},{"$f":"SUM(F27:F29)","v":0},{"$f":"SUM(G27:G29)","v":0},0,0,0,0,0,0,0,0,0,0,0,0,{"$f":"SUM(D30:S30)","v":0},null,null,{"$f":"IF(AND(SUM(T30)=0,A30<>\"\"),\" - \"&C24&\" \n\",\"\")","v":" - C-2) PREVISIONE DEI COSTI DELLE ATTIVITA' (Per tipi di attivita')  \n"}]
[null,null,"(1) INCLUSA LA SPERIMENTAZIONE PROTOTIPI E PRE-SERIE"]
[]
[null,null,"C-3) DETTAGLIO COSTI STUDI DI FATTIBILITA' TECNICA  (Per tipo di costo)"]
[null,null,null,null,null," "]
[null,null," TIPO DI COSTO",{"$f":"$D$15","v":"COSTI CONSUNTIVATI"},{"$f":"$E$15","v":0},{"$f":"E35+1","v":1},{"$f":"F35+1","v":2},3,4,5,6,7,8,9,10,11,12,13,14,"TOTALE\nGENER."]
[null,null,"COSTO DEL PERSONALE",{"$f":"SUM(D32:D35)","v":0},{"$f":"ALL_C_PERSONALE!F96","v":0},{"$f":"ALL_C_PERSONALE!G96","v":0},{"$f":"ALL_C_PERSONALE!H96","v":0},{"$f":"ALL_C_PERSONALE!I96","v":0},{"$f":"ALL_C_PERSONALE!J96","v":0},{"$f":"ALL_C_PERSONALE!K96","v":0},{"$f":"ALL_C_PERSONALE!L96","v":0},{"$f":"ALL_C_PERSONALE!M96","v":0},{"$f":"ALL_C_PERSONALE!N96","v":0},{"$f":"ALL_C_PERSONALE!O96","v":0},{"$f":"ALL_C_PERSONALE!P96","v":0},{"$f":"ALL_C_PERSONALE!Q96","v":0},{"$f":"ALL_C_PERSONALE!R96","v":0},{"$f":"ALL_C_PERSONALE!S96","v":0},{"$f":"ALL_C_PERSONALE!T96","v":0},{"$f":"SUM(D36:S36)","v":0}]
[null,null,"MATERIALI",null,{"$f":"E118","v":0},{"$f":"F118","v":0},{"$f":"G118","v":0},0,0,0,0,0,0,0,0,0,0,0,0,{"$f":"SUM(D37:S37)","v":0}]
[null,null,"STRUMENTAZIONE E ATTREZZATURE",null,{"$f":"E290","v":0},{"$f":"F290","v":0},{"$f":"G290","v":0},0,0,0,0,0,0,0,0,0,0,0,0,{"$f":"SUM(D38:S38)","v":0}]
[null,null,"SERVIZI DI CONSULENZA",null,{"$f":"E461","v":0},{"$f":"F461","v":0},{"$f":"G461","v":0},0,0,0,0,0,0,0,0,0,0,0,0,{"$f":"SUM(D39:S39)","v":0}]
[null,null,"TOTALE GENERALE",{"$f":"SUM(D36:D39)","v":0},{"$f":"SUM(E36:E39)","v":0},{"$f":"SUM(F36:F39)","v":0},{"$f":"SUM(G36:G39)","v":0},0,0,0,0,0,0,0,0,0,0,0,0,{"$f":"SUM(D40:S40)","v":0},null,null,{"$f":"IF(AND(SUM(T40)=0,A40<>\"\"),\" - \"&C33&\" \n\",\"\")","v":""}]
[]
[null,null,"C-4) DETTAGLIO COSTI RICERCA INDUSTRIALE  (Per tipo di costo)"]
[]
[null,null," TIPO DI COSTO",{"$f":"$D$15","v":"COSTI CONSUNTIVATI"},{"$f":"$E$15","v":0},{"$f":"E44+1","v":1},{"$f":"F44+1","v":2},3,4,5,6,7,8,9,10,11,12,13,14,"TOTALE\nGENER."]
[null,null,"COSTO DEL PERSONALE",{"$f":"SUM(D41:D44)","v":0},{"$f":"ALL_C_PERSONALE!F97","v":0},{"$f":"ALL_C_PERSONALE!G97","v":0},{"$f":"ALL_C_PERSONALE!H97","v":0},{"$f":"ALL_C_PERSONALE!I97","v":0},{"$f":"ALL_C_PERSONALE!J97","v":0},{"$f":"ALL_C_PERSONALE!K97","v":0},{"$f":"ALL_C_PERSONALE!L97","v":0},{"$f":"ALL_C_PERSONALE!M97","v":0},{"$f":"ALL_C_PERSONALE!N97","v":0},{"$f":"ALL_C_PERSONALE!O97","v":0},{"$f":"ALL_C_PERSONALE!P97","v":0},{"$f":"ALL_C_PERSONALE!Q97","v":0},{"$f":"ALL_C_PERSONALE!R97","v":0},{"$f":"ALL_C_PERSONALE!S97","v":0},{"$f":"ALL_C_PERSONALE!T97","v":0},{"$f":"SUM(D45:S45)","v":0}]
[null,null,"MATERIALI",null,{"$f":"E172","v":0},{"$f":"F172","v":0},{"$f":"G172","v":0},0,0,0,0,0,0,0,0,0,0,0,0,{"$f":"SUM(D46:S46)","v":0}]
[null,null,"STRUMENTAZIONE E ATTREZZATURE",null,{"$f":"E344","v":0},{"$f":"F344","v":0},{"$f":"G344","v":0},0,0,0,0,0,0,0,0,0,0,0,0,{"$f":"SUM(D47:S47)","v":0}]
[null,null,"SERVIZI DI CONSULENZA",null,{"$f":"E515","v":0},{"$f":"F515","v":0},{"$f":"G515","v":0},0,0,0,0,0,0,0,0,0,0,0,0,{"$f":"SUM(D48:S48)","v":0}]
[null,null,"TOTALE GENERALE",{"$f":"SUM(D45:D48)","v":0},{"$f":"SUM(E45:E48)","v":0},{"$f":"SUM(F45:F48)","v":0},{"$f":"SUM(G45:G48)","v":0},0,0,0,0,0,0,0,0,0,0,0,0,{"$f":"SUM(D49:S49)","v":0},null,null,{"$f":"IF(AND(SUM(T49)=0,A49<>\"\"),\" - \"&C42&\" \n\",\"\")","v":""}]
[]
[null,null,"C-5) DETTAGLIO COSTI SVILUPPO SPERIMENTALE   (Per tipo di costo) "]
[]
[null,null," TIPO DI COSTO",{"$f":"$D$15","v":"COSTI CONSUNTIVATI"},{"$f":"$E$15","v":0},{"$f":"E53+1","v":1},{"$f":"F53+1","v":2},3,4,5,6,7,8,9,10,11,12,13,14,"TOTALE\nGENER."]
[null,null,"COSTO DEL PERSONALE",{"$f":"SUM(D50:D53)","v":0},{"$f":"ALL_C_PERSONALE!F98","v":0},{"$f":"ALL_C_PERSONALE!G98","v":0},{"$f":"ALL_C_PERSONALE!H98","v":0},{"$f":"ALL_C_PERSONALE!I98","v":0},{"$f":"ALL_C_PERSONALE!J98","v":0},{"$f":"ALL_C_PERSONALE!K98","v":0},{"$f":"ALL_C_PERSONALE!L98","v":0},{"$f":"ALL_C_PERSONALE!M98","v":0},{"$f":"ALL_C_PERSONALE!N98","v":0},{"$f":"ALL_C_PERSONALE!O98","v":0},{"$f":"ALL_C_PERSONALE!P98","v":0},{"$f":"ALL_C_PERSONALE!Q98","v":0},{"$f":"ALL_C_PERSONALE!R98","v":0},{"$f":"ALL_C_PERSONALE!S98","v":0},{"$f":"ALL_C_PERSONALE!T98","v":0},{"$f":"SUM(D54:S54)","v":0}]
[null,null,"MATERIALI",null,{"$f":"E226","v":0},{"$f":"F226","v":0},{"$f":"G226","v":0},0,0,0,0,0,0,0,0,0,0,0,0,{"$f":"SUM(D55:S55)","v":0}]
[null,null,"STRUMENTAZIONE E ATTREZZATURE",null,{"$f":"E398","v":0},{"$f":"F398","v":0},{"$f":"G398","v":0},0,0,0,0,0,0,0,0,0,0,0,0,{"$f":"SUM(D56:S56)","v":0}]
[null,null,"SERVIZI DI CONSULENZA",null,{"$f":"E569","v":0},{"$f":"F569","v":0},{"$f":"G569","v":0},0,0,0,0,0,0,0,0,0,0,0,0,{"$f":"SUM(D57:S57)","v":0}]
[null,null,"TOTALE GENERALE",{"$f":"SUM(D54:D57)","v":0},{"$f":"SUM(E54:E57)","v":0},{"$f":"SUM(F54:F57)","v":0},{"$f":"SUM(G54:G57)","v":0},0,0,0,0,0,0,0,0,0,0,0,0,{"$f":"SUM(D58:S58)","v":0},null,null,{"$f":"IF(AND(SUM(T58)=0,A58<>\"\"),\" - \"&C51&\" \n\",\"\")","v":""}]
[]
[null,null,"COSTI DEL PERSONALE"]
[]
[]
[null,null,"A - MATERIALI: DETTAGLIO\n(VALORI ASSOLUTI PER MACRO-VOCI,SONO ESCLUSI : MATERIALI MINUTI OVVERO ORDINARI ATTERZZI DI LAVORO E MINUTERIA METALLICA ED ELETTRICA, ECC.)"]
[]
[null,null,"DESCRIZIONE",null,{"$f":"$E$15","v":0},{"$f":"E65+1","v":1},{"$f":"F65+1","v":2},3,4,5,6,7,8,9,10,11,12,13,14,"TOTALE\nGENER."]
[]
[null,null,"A.1 - MATERIALI PER STUDI DI FATTIBILITA' TECNICA"]
[null,"A.1.1",null,null,null,null,null,null,null,null,null,null,null,null,null,null,null,null,null,{"$f":"SUM(E68:S68)","v":0}]
[null,"A.1.2",null,null,null,null,null,null,null,null,null,null,null,null,null,null,null,null,null,{"$f":"SUM(E69:S69)","v":0}]
[null,"A.1.3",null,null,null,null,null,null,null,null,null,null,null,null,null,null,null,null,null,0]
[null,"A.1.4",null,null,null,null,null,null,null,null,null,null,null,null,null,null,null,null,null,0]
[null,"A.1.5",null,null,null,null,null,null,null,null,null,null,null,null,null,null,null,null,null,0]
[null,"A.1.6",null,null,null,null,null,null,null,null,null,null,null,null,null,null,null,null,null,0]
[null,"A.1.7",null,null,null,null,null,null,null,null,null,null,null,null,null,null,null,null,null,0]
[null,"A.1.8",null,null,null,null,null,null,null,null,null,null,null,null,null,null,null,null,null,0]
[null,"A.1.9",null,null,null,null,null,null,null,null,null,null,null,null,null,null,null,null,null,0]
[null,"A.1.10",null,null,null,null,null,null,null,null,null,null,null,null,null,null,null,null,null,0]
[null,"A.1.11",null,null,null,null,null,null,null,null,null,null,null,null,null,null,null,null,null,0]
[null,"A.1.12",null,null,null,null,null,null,null,null,null,null,null,null,null,null,null,null,null,0]
[null,"A.1.13",null,null,null,null,null,null,null,null,null,null,null,null,null,null,null,null,null,0]
[null,"A.1.14",null,null,null,null,null,null,null,null,null,null,null,null,null,null,null,null,null,0]
[null,"A.1.15",null,null,null,null,null,null,null,null,null,null,null,null,null,null,null,null,null,0]
[null,"A.1.16",null,null,null,null,null,null,null,null,null,null,null,null,null,null,null,null,null,0]
[null,"A.1.17",null,null,null,null,null,null,null,null,null,null,null,null,null,null,null,null,null,0]
[null,"A.1.18",null,null,null,null,null,null,null,null,null,null,null,null,null,null,null,null,null,0]
[null,"A.1.19",null,null,null,null,null,null,null,null,null,null,null,null,null,null,null,null,null,0]
[null,"A.1.20",null,null,null,null,null,null,null,null,null,null,null,null,null,null,null,null,null,0]
[null,"A.1.21",null,null,null,null,null,null,null,null,null,null,null,null,null,null,null,null,null,0]
[null,"A.1.22",null,null,null,null,null,null,null,null,null,null,null,null,null,null,null,null,null,0]
[null,"A.1.23",null,null,null,null,null,null,null,null,null,null,null,null,null,null,null,null,null,0]
[null,"A.1.24",null,null,null,null,null,null,null,null,null,null,null,null,null,null,null,null,null,0]
[null,"A.1.25",null,null,null,null,null,null,null,null,null,null,null,null,null,null,null,null,null,0]
[null,"A.1.26",null,null,null,null,null,null,null,null,null,null,null,null,null,null,null,null,null,0]
[null,"A.1.27",null,null,null,null,null,null,null,null,null,null,null,null,null,null,null,null,null,0]
[null,"A.1.28",null,null,null,null,null,null,null,null,null,null,null,null,null,null,null,null,null,0]
[null,"A.1.29",null,null,null,null,null,null,null,null,null,null,null,null,null,null,null,null,null,0]
[null,"A.1.30",null,null,null,null,null,null,null,null,null,null,null,null,null,null,null,null,null,0]
[null,"A.1.31",null,null,null,null,null,null,null,null,null,null,null,null,null,null,null,null,null,0]
[null,"A.1.32",null,null,null,null,null,null,null,null,null,null,null,null,null,null,null,null,null,0]
[null,"A.1.33",null,null,null,null,null,null,null,null,null,null,null,null,null,null,null,null,null,0]
[null,"A.1.34",null,null,null,null,null,null,null,null,null,null,null,null,null,null,null,null,null,0]
[null,"A.1.35",null,null,null,null,null,null,null,null,null,null,null,null,null,null,null,null,null,0]
[null,"A.1.36",null,null,null,null,null,null,null,null,null,null,null,null,null,null,null,null,null,0]
[null,"A.1.37",null,null,null,null,null,null,null,null,null,null,null,null,null,null,null,null,null,0]
[null,"A.1.38",null,null,null,null,null,null,null,null,null,null,null,null,null,null,null,null,null,0]
[null,"A.1.39",null,null,null,null,null,null,null,null,null,null,null,null,null,null,null,null,null,0]
[null,"A.1.40",null,null,null,null,null,null,null,null,null,null,null,null,null,null,null,null,null,0]
[null,"A.1.41",null,null,null,null,null,null,null,null,null,null,null,null,null,null,null,null,null,0]
[null,"A.1.42",null,null,null,null,null,null,null,null,null,null,null,null,null,null,null,null,null,0]
[null,"A.1.43",null,null,null,null,null,null,null,null,null,null,null,null,null,null,null,null,null,0]
[null,"A.1.44",null,null,null,null,null,null,null,null,null,null,null,null,null,null,null,null,null,0]
[null,"A.1.45",null,null,null,null,null,null,null,null,null,null,null,null,null,null,null,null,null,0]
[null,"A.1.46",null,null,null,null,null,null,null,null,null,null,null,null,null,null,null,null,null,0]
[null,"A.1.47",null,null,null,null,null,null,null,null,null,null,null,null,null,null,null,null,null,0]
[null,"A.1.48",null,null,null,null,null,null,null,null,null,null,null,null,null,null,null,null,null,0]
[null,"A.1.49",null,null,null,null,null,null,null,null,null,null,null,null,null,null,null,null,null,0]
[null,"A.1.50",null,null,null,null,null,null,null,null,null,null,null,null,null,null,null,null,null,0]
[null,null,"A.1 - MATERIALI STUDI FATT.TA' VALORE TOTALE",null,{"$f":"SUM(E68:E117)","v":0},{"$f":"SUM(F68:F117)","v":0},0,0,0,0,0,0,0,0,0,0,0,0,0,0]
[null,null,"A.1 - MATERIALI\nSTUDI FATT.TA' %",null,{"$f":"IF(E$229=0,\"\",E118/E$229)","v":""},{"$f":"IF(F$229=0,\"\",F118/F$229)","v":""},"","","","","","","","","","","","",""]
[]
[null,null,"A.2 - MATERIALI PER RICERCA INDUSTRIALE"]
[null,"A.2.1",null,null,null,null,null,null,null,null,null,null,null,null,null,null,null,null,null,{"$f":"SUM(E122:S122)","v":0}]
[null,"A.2.2",null,null,null,null,null,null,null,null,null,null,null,null,null,null,null,null,null,0]
[null,"A.2.3",null,null,null,null,null,null,null,null,null,null,null,null,null,null,null,null,null,0]
[null,"A.2.4",null,null,null,null,null,null,null,null,null,null,null,null,null,null,null,null,null,0]
[null,"A.2.5",null,null,null,null,null,null,null,null,null,null,null,null,null,null,null,null,null,0]
[null,"A.2.6",null,null,null,null,null,null,null,null,null,null,null,null,null,null,null,null,null,0]
[null,"A.2.7",null,null,null,null,null,null,null,null,null,null,null,null,null,null,null,null,null,0]
[null,"A.2.8",null,null,null,null,null,null,null,null,null,null,null,null,null,null,null,null,null,0]
[null,"A.2.9",null,null,null,null,null,null,null,null,null,null,null,null,null,null,null,null,null,0]
[null,"A.2.10",null,null,null,null,null,null,null,null,null,null,null,null,null,null,null,null,null,0]
[null,"A.2.11",null,null,null,null,null,null,null,null,null,null,null,null,null,null,null,null,null,0]
[null,"A.2.12",null,null,null,null,null,null,null,null,null,null,null,null,null,null,null,null,null,0]
[null,"A.2.13",null,null,null,null,null,null,null,null,null,null,null,null,null,null,null,null,null,0]
[null,"A.2.14",null,null,null,null,null,null,null,null,null,null,null,null,null,null,null,null,null,0]
[null,"A.2.15",null,null,null,null,null,null,null,null,null,null,null,null,null,null,null,null,null,0]
[null,"A.2.16",null,null,null,null,null,null,null,null,null,null,null,null,null,null,null,null,null,0]
[null,"A.2.17",null,null,null,null,null,null,null,null,null,null,null,null,null,null,null,null,null,0]
[null,"A.2.18",null,null,null,null,null,null,null,null,null,null,null,null,null,null,null,null,null,0]
[null,"A.2.19",null,null,null,null,null,null,null,null,null,null,null,null,null,null,null,null,null,0]
[null,"A.2.20",null,null,null,null,null,null,null,null,null,null,null,null,null,null,null,null,null,0]
[null,"A.2.21",null,null,null,null,null,null,null,null,null,null,null,null,null,null,null,null,null,0]
[null,"A.2.22",null,null,null,null,null,null,null,null,null,null,null,null,null,null,null,null,null,0]
[null,"A.2.23",null,null,null,null,null,null,null,null,null,null,null,null,null,null,null,null,null,0]
[null,"A.2.24",null,null,null,null,null,null,null,null,null,null,null,null,null,null,null,null,null,0]
[null,"A.2.25",null,null,null,null,null,null,null,null,null,null,null,null,null,null,null,null,null,0]
[null,"A.2.26",null,null,null,null,null,null,null,null,null,null,null,null,null,null,null,null,null,0]
[null,"A.2.27",null,null,null,null,null,null,null,null,null,null,null,null,null,null,null,null,null,0]
[null,"A.2.28",null,null,null,null,null,null,null,null,null,null,null,null,null,null,null,null,null,0]
[null,"A.2.29",null,null,null,null,null,null,null,null,null,null,null,null,null,null,null,null,null,0]
[null,"A.2.30",null,null,null,null,null,null,null,null,null,null,null,null,null,null,null,null,null,0]
[null,"A.2.31",null,null,null,null,null,null,null,null,null,null,null,null,null,null,null,null,null,0]
[null,"A.2.32",null,null,null,null,null,null,null,null,null,null,null,null,null,null,null,null,null,0]
[null,"A.2.33",null,null,null,null,null,null,null,null,null,null,null,null,null,null,null,null,null,0]
[null,"A.2.34",null,null,null,null,null,null,null,null,null,null,null,null,null,null,null,null,null,0]
[null,"A.2.35",null,null,null,null,null,null,null,null,null,null,null,null,null,null,null,null,null,0]
[null,"A.2.36",null,null,null,null,null,null,null,null,null,null,null,null,null,null,null,null,null,0]
[null,"A.2.37",null,null,null,null,null,null,null,null,null,null,null,null,null,null,null,null,null,0]
[null,"A.2.38",null,null,null,null,null,null,null,null,null,null,null,null,null,null,null,null,null,0]
[null,"A.2.39",null,null,null,null,null,null,null,null,null,null,null,null,null,null,null,null,null,0]
[null,"A.2.40",null,null,null,null,null,null,null,null,null,null,null,null,null,null,null,null,null,0]
[null,"A.2.41",null,null,null,null,null,null,null,null,null,null,null,null,null,null,null,null,null,0]
[null,"A.2.42",null,null,null,null,null,null,null,null,null,null,null,null,null,null,null,null,null,0]
[null,"A.2.43",null,null,null,null,null,null,null,null,null,null,null,null,null,null,null,null,null,0]
[null,"A.2.44",null,null,null,null,null,null,null,null,null,null,null,null,null,null,null,null,null,0]
[null,"A.2.45",null,null,null,null,null,null,null,null,null,null,null,null,null,null,null,null,null,0]
[null,"A.2.46",null,null,null,null,null,null,null,null,null,null,null,null,null,null,null,null,null,0]
[null,"A.2.47",null,null,null,null,null,null,null,null,null,null,null,null,null,null,null,null,null,0]
[null,"A.2.48",null,null,null,null,null,null,null,null,null,null,null,null,null,null,null,null,null,0]
[null,"A.2.49",null,null,null,null,null,null,null,null,null,null,null,null,null,null,null,null,null,0]
[null,"A.2.50",null,null,null,null,null,null,null,null,null,null,null,null,null,null,null,null,null,0]
[null,null,"A.2 - MATERIALI RICERCA INDUSTRIALE VALORE TOTALE",null,{"$f":"SUM(E122:E171)","v":0},{"$f":"SUM(F122:F171)","v":0},0,0,0,0,0,0,0,0,0,0,0,0,0,0]
[null,null,"A.2 - MATERIALI\nRICERCA INDUSTRIALE %",null,{"$f":"IF(E$229=0,\"\",E172/E$229)","v":""},{"$f":"IF(F$229=0,\"\",F172/F$229)","v":""},"","","","","","","","","","","","",""]
[]
[null,null,"A.3 - MATERIALI PER SVILUPPO SPERIMENTALE"]
[null,"A.3.1",null,null,null,null,null,null,null,null,null,null,null,null,null,null,null,null,null,{"$f":"SUM(E176:S176)","v":0}]
[null,"A.3.2",null,null,null,null,null,null,null,null,null,null,null,null,null,null,null,null,null,0]
[null,"A.3.3",null,null,null,null,null,null,null,null,null,null,null,null,null,null,null,null,null,0]
[null,"A.3.4",null,null,null,null,null,null,null,null,null,null,null,null,null,null,null,null,null,0]
[null,"A.3.5",null,null,null,null,null,null,null,null,null,null,null,null,null,null,null,null,null,0]
[null,"A.3.6",null,null,null,null,null,null,null,null,null,null,null,null,null,null,null,null,null,0]
[null,"A.3.7",null,null,null,null,null,null,null,null,null,null,null,null,null,null,null,null,null,0]
[null,"A.3.8",null,null,null,null,null,null,null,null,null,null,null,null,null,null,null,null,null,0]
[null,"A.3.9",null,null,null,null,null,null,null,null,null,null,null,null,null,null,null,null,null,0]
[null,"A.3.10",null,null,null,null,null,null,null,null,null,null,null,null,null,null,null,null,null,0]
[null,"A.3.11",null,null,null,null,null,null,null,null,null,null,null,null,null,null,null,null,null,0]
[null,"A.3.12",null,null,null,null,null,null,null,null,null,null,null,null,null,null,null,null,null,0]
[null,"A.3.13",null,null,null,null,null,null,null,null,null,null,null,null,null,null,null,null,null,0]
[null,"A.3.14",null,null,null,null,null,null,null,null,null,null,null,null,null,null,null,null,null,0]
[null,"A.3.15",null,null,null,null,null,null,null,null,null,null,null,null,null,null,null,null,null,0]
[null,"A.3.16",null,null,null,null,null,null,null,null,null,null,null,null,null,null,null,null,null,0]
[null,"A.3.17",null,null,null,null,null,null,null,null,null,null,null,null,null,null,null,null,null,0]
[null,"A.3.18",null,null,null,null,null,null,null,null,null,null,null,null,null,null,null,null,null,0]
[null,"A.3.19",null,null,null,null,null,null,null,null,null,null,null,null,null,null,null,null,null,0]
[null,"A.3.20",null,null,null,null,null,null,null,null,null,null,null,null,null,null,null,null,null,0]
[null,"A.3.21",null,null,null,null,null,null,null,null,null,null,null,null,null,null,null,null,null,0]
[null,"A.3.22",null,null,null,null,null,null,null,null,null,null,null,null,null,null,null,null,null,0]
[null,"A.3.23",null,null,null,null,null,null,null,null,null,null,null,null,null,null,null,null,null,0]
[null,"A.3.24",null,null,null,null,null,null,null,null,null,null,null,null,null,null,null,null,null,0]
[null,"A.3.25",null,null,null,null,null,null,null,null,null,null,null,null,null,null,null,null,null,0]
[null,"A.3.26",null,null,null,null,null,null,null,null,null,null,null,null,null,null,null,null,null,0]
[null,"A.3.27",null,null,null,null,null,null,null,null,null,null,null,null,null,null,null,null,null,0]
[null,"A.3.28",null,null,null,null,null,null,null,null,null,null,null,null,null,null,null,null,null,0]
[null,"A.3.29",null,null,null,null,null,null,null,null,null,null,null,null,null,null,null,null,null,0]
[null,"A.3.30",null,null,null,null,null,null,null,null,null,null,null,null,null,null,null,null,null,0]
[null,"A.3.31",null,null,null,null,null,null,null,null,null,null,null,null,null,null,null,null,null,0]
[null,"A.3.32",null,null,null,null,null,null,null,null,null,null,null,null,null,null,null,null,null,0]
[null,"A.3.33",null,null,null,null,null,null,null,null,null,null,null,null,null,null,null,null,null,0]
[null,"A.3.34",null,null,null,null,null,null,null,null,null,null,null,null,null,null,null,null,null,0]
[null,"A.3.35",null,null,null,null,null,null,null,null,null,null,null,null,null,null,null,null,null,0]
[null,"A.3.36",null,null,null,null,null,null,null,null,null,null,null,null,null,null,null,null,null,0]
[null,"A.3.37",null,null,null,null,null,null,null,null,null,null,null,null,null,null,null,null,null,0]
[null,"A.3.38",null,null,null,null,null,null,null,null,null,null,null,null,null,null,null,null,null,0]
[null,"A.3.39",null,null,null,null,null,null,null,null,null,null,null,null,null,null,null,null,null,0]
[null,"A.3.40",null,null,null,null,null,null,null,null,null,null,null,null,null,null,null,null,null,0]
[null,"A.3.41",null,null,null,null,null,null,null,null,null,null,null,null,null,null,null,null,null,0]
[null,"A.3.42",null,null,null,null,null,null,null,null,null,null,null,null,null,null,null,null,null,0]
[null,"A.3.43",null,null,null,null,null,null,null,null,null,null,null,null,null,null,null,null,null,0]
[null,"A.3.44",null,null,null,null,null,null,null,null,null,null,null,null,null,null,null,null,null,0]
[null,"A.3.45",null,null,null,null,null,null,null,null,null,null,null,null,null,null,null,null,null,0]
[null,"A.3.46",null,null,null,null,null,null,null,null,null,null,null,null,null,null,null,null,null,0]
[null,"A.3.47",null,null,null,null,null,null,null,null,null,null,null,null,null,null,null,null,null,0]
[null,"A.3.48",null,null,null,null,null,null,null,null,null,null,null,null,null,null,null,null,null,0]
[null,"A.3.49",null,null,null,null,null,null,null,null,null,null,null,null,null,null,null,null,null,0]
[null,"A.3.50",null,null,null,null,null,null,null,null,null,null,null,null,null,null,null,null,null,0]
[null,null,"A.3 - MATERIALI SVILUPPO SPERIMENTALE VALORE TOTALE",null,{"$f":"SUM(E176:E225)","v":0},{"$f":"SUM(F176:F225)","v":0},0,0,0,0,0,0,0,0,0,0,0,0,0,0]
[null,null,"A.3 - MATERIALI SVILUPPO\nSPERIMENTALE %",null,{"$f":"IF(E$229=0,\"\",E226/E$229)","v":""},{"$f":"IF(F$229=0,\"\",F226/F$229)","v":""},"","","","","","","","","","","","",""]
[]
[null,null,"A - TOTALE MATERIALI",null,{"$f":"E226+E172+E118","v":0},{"$f":"F226+F172+F118","v":0},0,0,0,0,0,0,0,0,0,0,0,0,0,0,null,null,{"$f":"IF(AND(SUM(T229)=0,A229<>\"\"),\" - \" &\"MATERIALI: DETTAGLIO\"&\" \n\",\"\")","v":""}]
[]
[]
[null,null,"(*) SONO ESCLUSI DAL SEGUENTE ELENCO: MATERIALI DI CONSUMO, UTENSILERIE, E MINUTERIA  O MATERIALE CON DESCRIZIONE GENERICA"]
[]
[]
[null,null,"B - STRUMENTAZIONE ED ATTREZZATURE: DETTAGLIO \n(SONO AMMISSIBILI I COSTI DELLE ATTREZZATURE E STRUMENTAZIONI DI NUOVO ACQUISTO, NELLA MISURA E PER IL PERIODO IN CUI SONO UTILIZZATI PER LE ATTIVITA' DEL progetto DI RICERCA E SVILUPPO, NEL LIMITE DELLE QUOTE DI AMMORTAMENTO FISCALI ORDINARIE)"]
[]
[null,null,"DESCRIZIONE",null,{"$f":"$E$15","v":0},{"$f":"E237+1","v":1},{"$f":"F237+1","v":2},3,4,5,6,7,8,9,10,11,12,13,14,"TOTALE\nGENER."]
[]
[null,null,"B.1 - STRUMENTAZIONE ED ATTREZZATURE PER STUDI DI FATTIBILITA' TECNICA"]
[null,"B.1.1",null,null,null,null,null,null,null,null,null,null,null,null,null,null,null,null,null,{"$f":"SUM(E240:S240)","v":0}]
[null,"B.1.2",null,null,null,null,null,null,null,null,null,null,null,null,null,null,null,null,null,0]
[null,"B.1.3",null,null,null,null,null,null,null,null,null,null,null,null,null,null,null,null,null,0]
[null,"B.1.4",null,null,null,null,null,null,null,null,null,null,null,null,null,null,null,null,null,0]
[null,"B.1.5",null,null,null,null,null,null,null,null,null,null,null,null,null,null,null,null,null,0]
[null,"B.1.6",null,null,null,null,null,null,null,null,null,null,null,null,null,null,null,null,null,0]
[null,"B.1.7",null,null,null,null,null,null,null,null,null,null,null,null,null,null,null,null,null,0]
[null,"B.1.8",null,null,null,null,null,null,null,null,null,null,null,null,null,null,null,null,null,0]
[null,"B.1.9",null,null,null,null,null,null,null,null,null,null,null,null,null,null,null,null,null,0]
[null,"B.1.10",null,null,null,null,null,null,null,null,null,null,null,null,null,null,null,null,null,0]
[null,"B.1.11",null,null,null,null,null,null,null,null,null,null,null,null,null,null,null,null,null,0]
[null,"B.1.12",null,null,null,null,null,null,null,null,null,null,null,null,null,null,null,null,null,0]
[null,"B.1.13",null,null,null,null,null,null,null,null,null,null,null,null,null,null,null,null,null,0]
[null,"B.1.14",null,null,null,null,null,null,null,null,null,null,null,null,null,null,null,null,null,0]
[null,"B.1.15",null,null,null,null,null,null,null,null,null,null,null,null,null,null,null,null,null,0]
[null,"B.1.16",null,null,null,null,null,null,null,null,null,null,null,null,null,null,null,null,null,0]
[null,"B.1.17",null,null,null,null,null,null,null,null,null,null,null,null,null,null,null,null,null,0]
[null,"B.1.18",null,null,null,null,null,null,null,null,null,null,null,null,null,null,null,null,null,0]
[null,"B.1.19",null,null,null,null,null,null,null,null,null,null,null,null,null,null,null,null,null,0]
[null,"B.1.20",null,null,null,null,null,null,null,null,null,null,null,null,null,null,null,null,null,0]
[null,"B.1.21",null,null,null,null,null,null,null,null,null,null,null,null,null,null,null,null,null,0]
[null,"B.1.22",null,null,null,null,null,null,null,null,null,null,null,null,null,null,null,null,null,0]
[null,"B.1.23",null,null,null,null,null,null,null,null,null,null,null,null,null,null,null,null,null,0]
[null,"B.1.24",null,null,null,null,null,null,null,null,null,null,null,null,null,null,null,null,null,0]
[null,"B.1.25",null,null,null,null,null,null,null,null,null,null,null,null,null,null,null,null,null,0]
[null,"B.1.26",null,null,null,null,null,null,null,null,null,null,null,null,null,null,null,null,null,0]
[null,"B.1.27",null,null,null,null,null,null,null,null,null,null,null,null,null,null,null,null,null,0]
[null,"B.1.28",null,null,null,null,null,null,null,null,null,null,null,null,null,null,null,null,null,0]
[null,"B.1.29",null,null,null,null,null,null,null,null,null,null,null,null,null,null,null,null,null,0]
[null,"B.1.30",null,null,null,null,null,null,null,null,null,null,null,null,null,null,null,null,null,0]
[null,"B.1.31",null,null,null,null,null,null,null,null,null,null,null,null,null,null,null,null,null,0]
[null,"B.1.32",null,null,null,null,null,null,null,null,null,null,null,null,null,null,null,null,null,0]
[null,"B.1.33",null,null,null,null,null,null,null,null,null,null,null,null,null,null,null,null,null,0]
[null,"B.1.34",null,null,null,null,null,null,null,null,null,null,null,null,null,null,null,null,null,0]
[null,"B.1.35",null,null,null,null,null,null,null,null,null,null,null,null,null,null,null,null,null,0]
[null,"B.1.36",null,null,null,null,null,null,null,null,null,null,null,null,null,null,null,null,null,0]
[null,"B.1.37",null,null,null,null,null,null,null,null,null,null,null,null,null,null,null,null,null,0]
[null,"B.1.38",null,null,null,null,null,null,null,null,null,null,null,null,null,null,null,null,null,0]
[null,"B.1.39",null,null,null,null,null,null,null,null,null,null,null,null,null,null,null,null,null,0]
[null,"B.1.40",null,null,null,null,null,null,null,null,null,null,null,null,null,null,null,null,null,0]
[null,"B.1.41",null,null,null,null,null,null,null,null,null,null,null,null,null,null,null,null,null,0]
[null,"B.1.42",null,null,null,null,null,null,null,null,null,null,null,null,null,null,null,null,null,0]
[null,"B.1.43",null,null,null,null,null,null,null,null,null,null,null,null,null,null,null,null,null,0]
[null,"B.1.44",null,null,null,null,null,null,null,null,null,null,null,null,null,null,null,null,null,0]
[null,"B.1.45",null,null,null,null,null,null,null,null,null,null,null,null,null,null,null,null,null,0]
[null,"B.1.46",null,null,null,null,null,null,null,null,null,null,null,null,null,null,null,null,null,0]
[null,"B.1.47",null,null,null,null,null,null,null,null,null,null,null,null,null,null,null,null,null,0]
[null,"B.1.48",null,null,null,null,null,null,null,null,null,null,null,null,null,null,null,null,null,0]
[null,"B.1.49",null,null,null,null,null,null,null,null,null,null,null,null,null,null,null,null,null,0]
[null,"B.1.50",null,null,null,null,null,null,null,null,null,null,null,null,null,null,null,null,null,0]
[null,null,"B.1 - STRUMENTAZIONE ED ATTREZZATURE STUDI FATT.TA' VALORE TOTALE",null,{"$f":"SUM(E240:E289)","v":0},{"$f":"SUM(F240:F289)","v":0},0,0,0,0,0,0,0,0,0,0,0,0,0,0]
[null,null,"B.1 - STRUM. E ATTREZZ.\nSTUDI FATT.TA' %",null,{"$f":"IF(E$401=0,\"\",E290/E$401)","v":""},{"$f":"IF(F$401=0,\"\",F290/F$401)","v":""},"","","","","","","","","","","","",""]
[]
[null,null,"B.2 - STRUMENTAZIONE ED ATTREZZATURE PER RICERCA INDUSTRIALE"]
[null,"B.2.1",null,null,null,null,null,null,null,null,null,null,null,null,null,null,null,null,null,{"$f":"SUM(E294:S294)","v":0}]
[null,"B.2.2",null,null,null,null,null,null,null,null,null,null,null,null,null,null,null,null,null,0]
[null,"B.2.3",null,null,null,null,null,null,null,null,null,null,null,null,null,null,null,null,null,0]
[null,"B.2.4",null,null,null,null,null,null,null,null,null,null,null,null,null,null,null,null,null,0]
[null,"B.2.5",null,null,null,null,null,null,null,null,null,null,null,null,null,null,null,null,null,0]
[null,"B.2.6",null,null,null,null,null,null,null,null,null,null,null,null,null,null,null,null,null,0]
[null,"B.2.7",null,null,null,null,null,null,null,null,null,null,null,null,null,null,null,null,null,0]
[null,"B.2.8",null,null,null,null,null,null,null,null,null,null,null,null,null,null,null,null,null,0]
[null,"B.2.9",null,null,null,null,null,null,null,null,null,null,null,null,null,null,null,null,null,0]
[null,"B.2.10",null,null,null,null,null,null,null,null,null,null,null,null,null,null,null,null,null,0]
[null,"B.2.11",null,null,null,null,null,null,null,null,null,null,null,null,null,null,null,null,null,0]
[null,"B.2.12",null,null,null,null,null,null,null,null,null,null,null,null,null,null,null,null,null,0]
[null,"B.2.13",null,null,null,null,null,null,null,null,null,null,null,null,null,null,null,null,null,0]
[null,"B.2.14",null,null,null,null,null,null,null,null,null,null,null,null,null,null,null,null,null,0]
[null,"B.2.15",null,null,null,null,null,null,null,null,null,null,null,null,null,null,null,null,null,0]
[null,"B.2.16",null,null,null,null,null,null,null,null,null,null,null,null,null,null,null,null,null,0]
[null,"B.2.17",null,null,null,null,null,null,null,null,null,null,null,null,null,null,null,null,null,0]
[null,"B.2.18",null,null,null,null,null,null,null,null,null,null,null,null,null,null,null,null,null,0]
[null,"B.2.19",null,null,null,null,null,null,null,null,null,null,null,null,null,null,null,null,null,0]
[null,"B.2.20",null,null,null,null,null,null,null,null,null,null,null,null,null,null,null,null,null,0]
[null,"B.2.21",null,null,null,null,null,null,null,null,null,null,null,null,null,null,null,null,null,0]
[null,"B.2.22",null,null,null,null,null,null,null,null,null,null,null,null,null,null,null,null,null,0]
[null,"B.2.23",null,null,null,null,null,null,null,null,null,null,null,null,null,null,null,null,null,0]
[null,"B.2.24",null,null,null,null,null,null,null,null,null,null,null,null,null,null,null,null,null,0]
[null,"B.2.25",null,null,null,null,null,null,null,null,null,null,null,null,null,null,null,null,null,0]
[null,"B.2.26",null,null,null,null,null,null,null,null,null,null,null,null,null,null,null,null,null,0]
[null,"B.2.27",null,null,null,null,null,null,null,null,null,null,null,null,null,null,null,null,null,0]
[null,"B.2.28",null,null,null,null,null,null,null,null,null,null,null,null,null,null,null,null,null,0]
[null,"B.2.29",null,null,null,null,null,null,null,null,null,null,null,null,null,null,null,null,null,0]
[null,"B.2.30",null,null,null,null,null,null,null,null,null,null,null,null,null,null,null,null,null,0]
[null,"B.2.31",null,null,null,null,null,null,null,null,null,null,null,null,null,null,null,null,null,0]
[null,"B.2.32",null,null,null,null,null,null,null,null,null,null,null,null,null,null,null,null,null,0]
[null,"B.2.33",null,null,null,null,null,null,null,null,null,null,null,null,null,null,null,null,null,0]
[null,"B.2.34",null,null,null,null,null,null,null,null,null,null,null,null,null,null,null,null,null,0]
[null,"B.2.35",null,null,null,null,null,null,null,null,null,null,null,null,null,null,null,null,null,0]
[null,"B.2.36",null,null,null,null,null,null,null,null,null,null,null,null,null,null,null,null,null,0]
[null,"B.2.37",null,null,null,null,null,null,null,null,null,null,null,null,null,null,null,null,null,0]
[null,"B.2.38",null,null,null,null,null,null,null,null,null,null,null,null,null,null,null,null,null,0]
[null,"B.2.39",null,null,null,null,null,null,null,null,null,null,null,null,null,null,null,null,null,0]
[null,"B.2.40",null,null,null,null,null,null,null,null,null,null,null,null,null,null,null,null,null,0]
[null,"B.2.41",null,null,null,null,null,null,null,null,null,null,null,null,null,null,null,null,null,0]
[null,"B.2.42",null,null,null,null,null,null,null,null,null,null,null,null,null,null,null,null,null,0]
[null,"B.2.43",null,null,null,null,null,null,null,null,null,null,null,null,null,null,null,null,null,0]
[null,"B.2.44",null,null,null,null,null,null,null,null,null,null,null,null,null,null,null,null,null,0]
[null,"B.2.45",null,null,null,null,null,null,null,null,null,null,null,null,null,null,null,null,null,0]
[null,"B.2.46",null,null,null,null,null,null,null,null,null,null,null,null,null,null,null,null,null,0]
[null,"B.2.47",null,null,null,null,null,null,null,null,null,null,null,null,null,null,null,null,null,0]
[null,"B.2.48",null,null,null,null,null,null,null,null,null,null,null,null,null,null,null,null,null,0]
[null,"B.2.49",null,null,null,null,null,null,null,null,null,null,null,null,null,null,null,null,null,0]
[null,"B.2.50",null,null,null,null,null,null,null,null,null,null,null,null,null,null,null,null,null,0]
[null,null,"B.2 - STRUMENTAZIONE ED ATTREZZATURE RICERCA INDUSTRIALE VALORE TOTALE",null,{"$f":"SUM(E294:E343)","v":0},{"$f":"SUM(F294:F343)","v":0},0,0,0,0,0,0,0,0,0,0,0,0,0,0]
[null,null,"B.2 - STRUM. E ATTREZZ.\nRICERCA INDUSTRIALE %",null,{"$f":"IF(E$401=0,\"\",E344/E$401)","v":""},{"$f":"IF(F$401=0,\"\",F344/F$401)","v":""},"","","","","","","","","","","","",""]
[]
[null,null,"B.3 - STRUMENTAZIONE ED ATTREZZATURE SVILUPPO SPERIMENTALE"]
[null,"B.3.1",null,null,null,null,null,null,null,null,null,null,null,null,null,null,null,null,null,{"$f":"SUM(E348:S348)","v":0}]
[null,"B.3.2",null,null,null,null,null,null,null,null,null,null,null,null,null,null,null,null,null,0]
[null,"B.3.3",null,null,null,null,null,null,null,null,null,null,null,null,null,null,null,null,null,0]
[null,"B.3.4",null,null,null,null,null,null,null,null,null,null,null,null,null,null,null,null,null,0]
[null,"B.3.5",null,null,null,null,null,null,null,null,null,null,null,null,null,null,null,null,null,0]
[null,"B.3.6",null,null,null,null,null,null,null,null,null,null,null,null,null,null,null,null,null,0]
[null,"B.3.7",null,null,null,null,null,null,null,null,null,null,null,null,null,null,null,null,null,0]
[null,"B.3.8",null,null,null,null,null,null,null,null,null,null,null,null,null,null,null,null,null,0]
[null,"B.3.9",null,null,null,null,null,null,null,null,null,null,null,null,null,null,null,null,null,0]
[null,"B.3.10",null,null,null,null,null,null,null,null,null,null,null,null,null,null,null,null,null,0]
[null,"B.3.11",null,null,null,null,null,null,null,null,null,null,null,null,null,null,null,null,null,0]
[null,"B.3.12",null,null,null,null,null,null,null,null,null,null,null,null,null,null,null,null,null,0]
[null,"B.3.13",null,null,null,null,null,null,null,null,null,null,null,null,null,null,null,null,null,0]
[null,"B.3.14",null,null,null,null,null,null,null,null,null,null,null,null,null,null,null,null,null,0]
[null,"B.3.15",null,null,null,null,null,null,null,null,null,null,null,null,null,null,null,null,null,0]
[null,"B.3.16",null,null,null,null,null,null,null,null,null,null,null,null,null,null,null,null,null,0]
[null,"B.3.17",null,null,null,null,null,null,null,null,null,null,null,null,null,null,null,null,null,0]
[null,"B.3.18",null,null,null,null,null,null,null,null,null,null,null,null,null,null,null,null,null,0]
[null,"B.3.19",null,null,null,null,null,null,null,null,null,null,null,null,null,null,null,null,null,0]
[null,"B.3.20",null,null,null,null,null,null,null,null,null,null,null,null,null,null,null,null,null,0]
[null,"B.3.21",null,null,null,null,null,null,null,null,null,null,null,null,null,null,null,null,null,0]
[null,"B.3.22",null,null,null,null,null,null,null,null,null,null,null,null,null,null,null,null,null,0]
[null,"B.3.23",null,null,null,null,null,null,null,null,null,null,null,null,null,null,null,null,null,0]
[null,"B.3.24",null,null,null,null,null,null,null,null,null,null,null,null,null,null,null,null,null,0]
[null,"B.3.25",null,null,null,null,null,null,null,null,null,null,null,null,null,null,null,null,null,0]
[null,"B.3.26",null,null,null,null,null,null,null,null,null,null,null,null,null,null,null,null,null,0]
[null,"B.3.27",null,null,null,null,null,null,null,null,null,null,null,null,null,null,null,null,null,0]
[null,"B.3.28",null,null,null,null,null,null,null,null,null,null,null,null,null,null,null,null,null,0]
[null,"B.3.29",null,null,null,null,null,null,null,null,null,null,null,null,null,null,null,null,null,0]
[null,"B.3.30",null,null,null,null,null,null,null,null,null,null,null,null,null,null,null,null,null,0]
[null,"B.3.31",null,null,null,null,null,null,null,null,null,null,null,null,null,null,null,null,null,0]
[null,"B.3.32",null,null,null,null,null,null,null,null,null,null,null,null,null,null,null,null,null,0]
[null,"B.3.33",null,null,null,null,null,null,null,null,null,null,null,null,null,null,null,null,null,0]
[null,"B.3.34",null,null,null,null,null,null,null,null,null,null,null,null,null,null,null,null,null,0]
[null,"B.3.35",null,null,null,null,null,null,null,null,null,null,null,null,null,null,null,null,null,0]
[null,"B.3.36",null,null,null,null,null,null,null,null,null,null,null,null,null,null,null,null,null,0]
[null,"B.3.37",null,null,null,null,null,null,null,null,null,null,null,null,null,null,null,null,null,0]
[null,"B.3.38",null,null,null,null,null,null,null,null,null,null,null,null,null,null,null,null,null,0]
[null,"B.3.39",null,null,null,null,null,null,null,null,null,null,null,null,null,null,null,null,null,0]
[null,"B.3.40",null,null,null,null,null,null,null,null,null,null,null,null,null,null,null,null,null,0]
[null,"B.3.41",null,null,null,null,null,null,null,null,null,null,null,null,null,null,null,null,null,0]
[null,"B.3.42",null,null,null,null,null,null,null,null,null,null,null,null,null,null,null,null,null,0]
[null,"B.3.43",null,null,null,null,null,null,null,null,null,null,null,null,null,null,null,null,null,0]
[null,"B.3.44",null,null,null,null,null,null,null,null,null,null,null,null,null,null,null,null,null,0]
[null,"B.3.45",null,null,null,null,null,null,null,null,null,null,null,null,null,null,null,null,null,0]
[null,"B.3.46",null,null,null,null,null,null,null,null,null,null,null,null,null,null,null,null,null,0]
[null,"B.3.47",null,null,null,null,null,null,null,null,null,null,null,null,null,null,null,null,null,0]
[null,"B.3.48",null,null,null,null,null,null,null,null,null,null,null,null,null,null,null,null,null,0]
[null,"B.3.49",null,null,null,null,null,null,null,null,null,null,null,null,null,null,null,null,null,0]
[null,"B.3.50",null,null,null,null,null,null,null,null,null,null,null,null,null,null,null,null,null,0]
[null,null,"B.3 - STRUMENTAZIONE ED ATTREZZATURE SVILUPPO SPERIMENTALE VALORE TOTALE",null,{"$f":"SUM(E348:E397)","v":0},{"$f":"SUM(F348:F397)","v":0},0,0,0,0,0,0,0,0,0,0,0,0,0,0]
[null,null,"B.3 - STRUM. E ATTREZZ.\nSVILUPPO SPERIMENTALE %",null,{"$f":"IF(E$401=0,\"\",E398/E$401)","v":""},{"$f":"IF(F$401=0,\"\",F398/F$401)","v":""},"","","","","","","","","","","","",""]
[]
[null,null,"B - TOTALE STRUMENTAZIONE ED ATTREZZATURE",null,{"$f":"E398+E344+E290","v":0},{"$f":"F398+F344+F290","v":0},0,0,0,0,0,0,0,0,0,0,0,0,0,0,null,null,{"$f":"IF(AND(SUM(T401)=0,A401<>\"\"),\" - \" &\"STRUMENTAZIONE ED ATTREZZATURE: DETTAGLIO\"&\" \n\",\"\")","v":""}]
[]
[]
[]
[]
[null,null,"C - SERVIZI DI CONSULENZA: DETTAGLIO"]
[]
[null,null,"DESCRIZIONE",null,{"$f":"$E$15","v":0},{"$f":"E408+1","v":1},{"$f":"F408+1","v":2},3,4,5,6,7,8,9,10,11,12,13,14,"TOTALE\nGENER."]
[]
[null,null,"C.1 - SERVIZI DI CONSULENZA PER STUDI DI FATTIBILITA' TECNICA"]
[null,"C.1.1",null,null,null,null,null,null,null,null,null,null,null,null,null,null,null,null,null,{"$f":"SUM(E411:S411)","v":0}]
[null,"C.1.2",null,null,null,null,null,null,null,null,null,null,null,null,null,null,null,null,null,0]
[null,"C.1.3",null,null,null,null,null,null,null,null,null,null,null,null,null,null,null,null,null,0]
[null,"C.1.4",null,null,null,null,null,null,null,null,null,null,null,null,null,null,null,null,null,0]
[null,"C.1.5",null,null,null,null,null,null,null,null,null,null,null,null,null,null,null,null,null,0]
[null,"C.1.6",null,null,null,null,null,null,null,null,null,null,null,null,null,null,null,null,null,0]
[null,"C.1.7",null,null,null,null,null,null,null,null,null,null,null,null,null,null,null,null,null,0]
[null,"C.1.8",null,null,null,null,null,null,null,null,null,null,null,null,null,null,null,null,null,0]
[null,"C.1.9",null,null,null,null,null,null,null,null,null,null,null,null,null,null,null,null,null,0]
[null,"C.1.10",null,null,null,null,null,null,null,null,null,null,null,null,null,null,null,null,null,0]
[null,"C.1.11",null,null,null,null,null,null,null,null,null,null,null,null,null,null,null,null,null,0]
[null,"C.1.12",null,null,null,null,null,null,null,null,null,null,null,null,null,null,null,null,null,0]
[null,"C.1.13",null,null,null,null,null,null,null,null,null,null,null,null,null,null,null,null,null,0]
[null,"C.1.14",null,null,null,null,null,null,null,null,null,null,null,null,null,null,null,null,null,0]
[null,"C.1.15",null,null,null,null,null,null,null,null,null,null,null,null,null,null,null,null,null,0]
[null,"C.1.16",null,null,null,null,null,null,null,null,null,null,null,null,null,null,null,null,null,0]
[null,"C.1.17",null,null,null,null,null,null,null,null,null,null,null,null,null,null,null,null,null,0]
[null,"C.1.18",null,null,null,null,null,null,null,null,null,null,null,null,null,null,null,null,null,0]
[null,"C.1.19",null,null,null,null,null,null,null,null,null,null,null,null,null,null,null,null,null,0]
[null,"C.1.20",null,null,null,null,null,null,null,null,null,null,null,null,null,null,null,null,null,0]
[null,"C.1.21",null,null,null,null,null,null,null,null,null,null,null,null,null,null,null,null,null,0]
[null,"C.1.22",null,null,null,null,null,null,null,null,null,null,null,null,null,null,null,null,null,0]
[null,"C.1.23",null,null,null,null,null,null,null,null,null,null,null,null,null,null,null,null,null,0]
[null,"C.1.24",null,null,null,null,null,null,null,null,null,null,null,null,null,null,null,null,null,0]
[null,"C.1.25",null,null,null,null,null,null,null,null,null,null,null,null,null,null,null,null,null,0]
[null,"C.1.26",null,null,null,null,null,null,null,null,null,null,null,null,null,null,null,null,null,0]
[null,"C.1.27",null,null,null,null,null,null,null,null,null,null,null,null,null,null,null,null,null,0]
[null,"C.1.28",null,null,null,null,null,null,null,null,null,null,null,null,null,null,null,null,null,0]
[null,"C.1.29",null,null,null,null,null,null,null,null,null,null,null,null,null,null,null,null,null,0]
[null,"C.1.30",null,null,null,null,null,null,null,null,null,null,null,null,null,null,null,null,null,0]
[null,"C.1.31",null,null,null,null,null,null,null,null,null,null,null,null,null,null,null,null,null,0]
[null,"C.1.32",null,null,null,null,null,null,null,null,null,null,null,null,null,null,null,null,null,0]
[null,"C.1.33",null,null,null,null,null,null,null,null,null,null,null,null,null,null,null,null,null,0]
[null,"C.1.34",null,null,null,null,null,null,null,null,null,null,null,null,null,null,null,null,null,0]
[null,"C.1.35",null,null,null,null,null,null,null,null,null,null,null,null,null,null,null,null,null,0]
[null,"C.1.36",null,null,null,null,null,null,null,null,null,null,null,null,null,null,null,null,null,0]
[null,"C.1.37",null,null,null,null,null,null,null,null,null,null,null,null,null,null,null,null,null,0]
[null,"C.1.38",null,null,null,null,null,null,null,null,null,null,null,null,null,null,null,null,null,0]
[null,"C.1.39",null,null,null,null,null,null,null,null,null,null,null,null,null,null,null,null,null,0]
[null,"C.1.40",null,null,null,null,null,null,null,null,null,null,null,null,null,null,null,null,null,0]
[null,"C.1.41",null,null,null,null,null,null,null,null,null,null,null,null,null,null,null,null,null,0]
[null,"C.1.42",null,null,null,null,null,null,null,null,null,null,null,null,null,null,null,null,null,0]
[null,"C.1.43",null,null,null,null,null,null,null,null,null,null,null,null,null,null,null,null,null,0]
[null,"C.1.44",null,null,null,null,null,null,null,null,null,null,null,null,null,null,null,null,null,0]
[null,"C.1.45",null,null,null,null,null,null,null,null,null,null,null,null,null,null,null,null,null,0]
[null,"C.1.46",null,null,null,null,null,null,null,null,null,null,null,null,null,null,null,null,null,0]
[null,"C.1.47",null,null,null,null,null,null,null,null,null,null,null,null,null,null,null,null,null,0]
[null,"C.1.48",null,null,null,null,null,null,null,null,null,null,null,null,null,null,null,null,null,0]
[null,"C.1.49",null,null,null,null,null,null,null,null,null,null,null,null,null,null,null,null,null,0]
[null,"C.1.50",null,null,null,null,null,null,null,null,null,null,null,null,null,null,null,null,null,0]
[null,null,"C.1 - SERVIZI DI CONSULENZA STUDI FATT.TA' VALORE TOTALE",null,{"$f":"SUM(E411:E460)","v":0},{"$f":"SUM(F411:F460)","v":0},0,0,0,0,0,0,0,0,0,0,0,0,0,0]
[null,null,"C.1 - SERVIZI CONSULENZA\nSTUDI FATT.TA' %",null,{"$f":"IF(E$572=0,\"\",E461/E$572)","v":""},{"$f":"IF(F$572=0,\"\",F461/F$572)","v":""},"","","","","","","","","","","","",""]
[]
[null,null,"C.2 - SERVIZI DI CONSULENZA PER RICERCA INDUSTRIALE"]
[null,"C.2.1",null,null,null,null,null,null,null,null,null,null,null,null,null,null,null,null,null,{"$f":"SUM(E465:S465)","v":0}]
[null,"C.2.2",null,null,null,null,null,null,null,null,null,null,null,null,null,null,null,null,null,0]
[null,"C.2.3",null,null,null,null,null,null,null,null,null,null,null,null,null,null,null,null,null,0]
[null,"C.2.4",null,null,null,null,null,null,null,null,null,null,null,null,null,null,null,null,null,0]
[null,"C.2.5",null,null,null,null,null,null,null,null,null,null,null,null,null,null,null,null,null,0]
[null,"C.2.6",null,null,null,null,null,null,null,null,null,null,null,null,null,null,null,null,null,0]
[null,"C.2.7",null,null,null,null,null,null,null,null,null,null,null,null,null,null,null,null,null,0]
[null,"C.2.8",null,null,null,null,null,null,null,null,null,null,null,null,null,null,null,null,null,0]
[null,"C.2.9",null,null,null,null,null,null,null,null,null,null,null,null,null,null,null,null,null,0]
[null,"C.2.10",null,null,null,null,null,null,null,null,null,null,null,null,null,null,null,null,null,0]
[null,"C.2.11",null,null,null,null,null,null,null,null,null,null,null,null,null,null,null,null,null,0]
[null,"C.2.12",null,null,null,null,null,null,null,null,null,null,null,null,null,null,null,null,null,0]
[null,"C.2.13",null,null,null,null,null,null,null,null,null,null,null,null,null,null,null,null,null,0]
[null,"C.2.14",null,null,null,null,null,null,null,null,null,null,null,null,null,null,null,null,null,0]
[null,"C.2.15",null,null,null,null,null,null,null,null,null,null,null,null,null,null,null,null,null,0]
[null,"C.2.16",null,null,null,null,null,null,null,null,null,null,null,null,null,null,null,null,null,0]
[null,"C.2.17",null,null,null,null,null,null,null,null,null,null,null,null,null,null,null,null,null,0]
[null,"C.2.18",null,null,null,null,null,null,null,null,null,null,null,null,null,null,null,null,null,0]
[null,"C.2.19",null,null,null,null,null,null,null,null,null,null,null,null,null,null,null,null,null,0]
[null,"C.2.20",null,null,null,null,null,null,null,null,null,null,null,null,null,null,null,null,null,0]
[null,"C.2.21",null,null,null,null,null,null,null,null,null,null,null,null,null,null,null,null,null,0]
[null,"C.2.22",null,null,null,null,null,null,null,null,null,null,null,null,null,null,null,null,null,0]
[null,"C.2.23",null,null,null,null,null,null,null,null,null,null,null,null,null,null,null,null,null,0]
[null,"C.2.24",null,null,null,null,null,null,null,null,null,null,null,null,null,null,null,null,null,0]
[null,"C.2.25",null,null,null,null,null,null,null,null,null,null,null,null,null,null,null,null,null,0]
[null,"C.2.26",null,null,null,null,null,null,null,null,null,null,null,null,null,null,null,null,null,0]
[null,"C.2.27",null,null,null,null,null,null,null,null,null,null,null,null,null,null,null,null,null,0]
[null,"C.2.28",null,null,null,null,null,null,null,null,null,null,null,null,null,null,null,null,null,0]
[null,"C.2.29",null,null,null,null,null,null,null,null,null,null,null,null,null,null,null,null,null,0]
[null,"C.2.30",null,null,null,null,null,null,null,null,null,null,null,null,null,null,null,null,null,0]
[null,"C.2.31",null,null,null,null,null,null,null,null,null,null,null,null,null,null,null,null,null,0]
[null,"C.2.32",null,null,null,null,null,null,null,null,null,null,null,null,null,null,null,null,null,0]
[null,"C.2.33",null,null,null,null,null,null,null,null,null,null,null,null,null,null,null,null,null,0]
[null,"C.2.34",null,null,null,null,null,null,null,null,null,null,null,null,null,null,null,null,null,0]
[null,"C.2.35",null,null,null,null,null,null,null,null,null,null,null,null,null,null,null,null,null,0]
[null,"C.2.36",null,null,null,null,null,null,null,null,null,null,null,null,null,null,null,null,null,0]
[null,"C.2.37",null,null,null,null,null,null,null,null,null,null,null,null,null,null,null,null,null,0]
[null,"C.2.38",null,null,null,null,null,null,null,null,null,null,null,null,null,null,null,null,null,0]
[null,"C.2.39",null,null,null,null,null,null,null,null,null,null,null,null,null,null,null,null,null,0]
[null,"C.2.40",null,null,null,null,null,null,null,null,null,null,null,null,null,null,null,null,null,0]
[null,"C.2.41",null,null,null,null,null,null,null,null,null,null,null,null,null,null,null,null,null,0]
[null,"C.2.42",null,null,null,null,null,null,null,null,null,null,null,null,null,null,null,null,null,0]
[null,"C.2.43",null,null,null,null,null,null,null,null,null,null,null,null,null,null,null,null,null,0]
[null,"C.2.44",null,null,null,null,null,null,null,null,null,null,null,null,null,null,null,null,null,0]
[null,"C.2.45",null,null,null,null,null,null,null,null,null,null,null,null,null,null,null,null,null,0]
[null,"C.2.46",null,null,null,null,null,null,null,null,null,null,null,null,null,null,null,null,null,0]
[null,"C.2.47",null,null,null,null,null,null,null,null,null,null,null,null,null,null,null,null,null,0]
[null,"C.2.48",null,null,null,null,null,null,null,null,null,null,null,null,null,null,null,null,null,0]
[null,"C.2.49",null,null,null,null,null,null,null,null,null,null,null,null,null,null,null,null,null,0]
[null,"C.2.50",null,null,null,null,null,null,null,null,null,null,null,null,null,null,null,null,null,0]
[null,null,"C.2 - SERVIZI DI CONSULENZA RICERCA INDUSTRIALE VALORE TOTALE",null,{"$f":"SUM(E465:E514)","v":0},{"$f":"SUM(F465:F514)","v":0},0,0,0,0,0,0,0,0,0,0,0,0,0,0]
[null,null,"C.2 - SERVIZI CONSULENZA\nRICERCA INDUSTRIALE %",null,{"$f":"IF(E$572=0,\"\",E515/E$572)","v":""},{"$f":"IF(F$572=0,\"\",F515/F$572)","v":""},"","","","","","","","","","","","",""]
[]
[null,null,"C.3 - SERVIZI DI CONSULENZA PER SVILUPPO SPERIMENTALE"]
[null,"C.3.1",null,null,null,null,null,null,null,null,null,null,null,null,null,null,null,null,null,{"$f":"SUM(E519:S519)","v":0}]
[null,"C.3.2",null,null,null,null,null,null,null,null,null,null,null,null,null,null,null,null,null,0]
[null,"C.3.3",null,null,null,null,null,null,null,null,null,null,null,null,null,null,null,null,null,0]
[null,"C.3.4",null,null,null,null,null,null,null,null,null,null,null,null,null,null,null,null,null,0]
[null,"C.3.5",null,null,null,null,null,null,null,null,null,null,null,null,null,null,null,null,null,0]
[null,"C.3.6",null,null,null,null,null,null,null,null,null,null,null,null,null,null,null,null,null,0]
[null,"C.3.7",null,null,null,null,null,null,null,null,null,null,null,null,null,null,null,null,null,0]
[null,"C.3.8",null,null,null,null,null,null,null,null,null,null,null,null,null,null,null,null,null,0]
[null,"C.3.9",null,null,null,null,null,null,null,null,null,null,null,null,null,null,null,null,null,0]
[null,"C.3.10",null,null,null,null,null,null,null,null,null,null,null,null,null,null,null,null,null,0]
[null,"C.3.11",null,null,null,null,null,null,null,null,null,null,null,null,null,null,null,null,null,0]
[null,"C.3.12",null,null,null,null,null,null,null,null,null,null,null,null,null,null,null,null,null,0]
[null,"C.3.13",null,null,null,null,null,null,null,null,null,null,null,null,null,null,null,null,null,0]
[null,"C.3.14",null,null,null,null,null,null,null,null,null,null,null,null,null,null,null,null,null,0]
[null,"C.3.15",null,null,null,null,null,null,null,null,null,null,null,null,null,null,null,null,null,0]
[null,"C.3.16",null,null,null,null,null,null,null,null,null,null,null,null,null,null,null,null,null,0]
[null,"C.3.17",null,null,null,null,null,null,null,null,null,null,null,null,null,null,null,null,null,0]
[null,"C.3.18",null,null,null,null,null,null,null,null,null,null,null,null,null,null,null,null,null,0]
[null,"C.3.19",null,null,null,null,null,null,null,null,null,null,null,null,null,null,null,null,null,0]
[null,"C.3.20",null,null,null,null,null,null,null,null,null,null,null,null,null,null,null,null,null,0]
[null,"C.3.21",null,null,null,null,null,null,null,null,null,null,null,null,null,null,null,null,null,0]
[null,"C.3.22",null,null,null,null,null,null,null,null,null,null,null,null,null,null,null,null,null,0]
[null,"C.3.23",null,null,null,null,null,null,null,null,null,null,null,null,null,null,null,null,null,0]
[null,"C.3.24",null,null,null,null,null,null,null,null,null,null,null,null,null,null,null,null,null,0]
[null,"C.3.25",null,null,null,null,null,null,null,null,null,null,null,null,null,null,null,null,null,0]
[null,"C.3.26",null,null,null,null,null,null,null,null,null,null,null,null,null,null,null,null,null,0]
[null,"C.3.27",null,null,null,null,null,null,null,null,null,null,null,null,null,null,null,null,null,0]
[null,"C.3.28",null,null,null,null,null,null,null,null,null,null,null,null,null,null,null,null,null,0]
[null,"C.3.29",null,null,null,null,null,null,null,null,null,null,null,null,null,null,null,null,null,0]
[null,"C.3.30",null,null,null,null,null,null,null,null,null,null,null,null,null,null,null,null,null,0]
[null,"C.3.31",null,null,null,null,null,null,null,null,null,null,null,null,null,null,null,null,null,0]
[null,"C.3.32",null,null,null,null,null,null,null,null,null,null,null,null,null,null,null,null,null,0]
[null,"C.3.33",null,null,null,null,null,null,null,null,null,null,null,null,null,null,null,null,null,0]
[null,"C.3.34",null,null,null,null,null,null,null,null,null,null,null,null,null,null,null,null,null,0]
[null,"C.3.35",null,null,null,null,null,null,null,null,null,null,null,null,null,null,null,null,null,0]
[null,"C.3.36",null,null,null,null,null,null,null,null,null,null,null,null,null,null,null,null,null,0]
[null,"C.3.37",null,null,null,null,null,null,null,null,null,null,null,null,null,null,null,null,null,0]
[null,"C.3.38",null,null,null,null,null,null,null,null,null,null,null,null,null,null,null,null,null,0]
[null,"C.3.39",null,null,null,null,null,null,null,null,null,null,null,null,null,null,null,null,null,0]
[null,"C.3.40",null,null,null,null,null,null,null,null,null,null,null,null,null,null,null,null,null,0]
[null,"C.3.41",null,null,null,null,null,null,null,null,null,null,null,null,null,null,null,null,null,0]
[null,"C.3.42",null,null,null,null,null,null,null,null,null,null,null,null,null,null,null,null,null,0]
[null,"C.3.43",null,null,null,null,null,null,null,null,null,null,null,null,null,null,null,null,null,0]
[null,"C.3.44",null,null,null,null,null,null,null,null,null,null,null,null,null,null,null,null,null,0]
[null,"C.3.45",null,null,null,null,null,null,null,null,null,null,null,null,null,null,null,null,null,0]
[null,"C.3.46",null,null,null,null,null,null,null,null,null,null,null,null,null,null,null,null,null,0]
[null,"C.3.47",null,null,null,null,null,null,null,null,null,null,null,null,null,null,null,null,null,0]
[null,"C.3.48",null,null,null,null,null,null,null,null,null,null,null,null,null,null,null,null,null,0]
[null,"C.3.49",null,null,null,null,null,null,null,null,null,null,null,null,null,null,null,null,null,0]
[null,"C.3.50",null,null,null,null,null,null,null,null,null,null,null,null,null,null,null,null,null,0]
[null,null,"C.3 - SERVIZI DI CONSULENZA SVILUPPO SPERIMENTALE VALORE TOTALE",null,{"$f":"SUM(E519:E568)","v":0},{"$f":"SUM(F519:F568)","v":0},0,0,0,0,0,0,0,0,0,0,0,0,0,0]
[null,null,"C.3 - SERVIZI CONSULENZA\nSVILUPPO SPERIMENTALE %",null,{"$f":"IF(E$572=0,\"\",E569/E$572)","v":""},{"$f":"IF(F$572=0,\"\",F569/F$572)","v":""},"","","","","","","","","","","","",""]
[]
[null,null,"C - TOTALE SERVIZI DI CONSULENZA",null,{"$f":"E569+E515+E461","v":0},{"$f":"F569+F515+F461","v":0},0,0,0,0,0,0,0,0,0,0,0,0,0,0,null,null,{"$f":"IF(AND(SUM(T572)=0,A572<>\"\"),\" - \" &\"SERVIZI DI CONSULENZA: DETTAGLIO\"&\" \n\",\"\")","v":""}]
[]
[]
[]
[]
[]
[]
[]
[]
[null,null,null,null,null,null,null,null,null,null,null,null,null,null,null,null,null,null,null,null,null,null,{"$f":"CONCATENATE(W10,W22,W30,W40,W49,W58,W229,W401,W572,ALL_C_PERSONALE!AA101)","v":" - C-2) PREVISIONE DEI COSTI DELLE ATTIVITA' (Per tipi di attivita')  \n - 1) COSTO ORARIO MEDIO RICERCATORI /TECNICI \n - 1) COSTO ORARIO MEDIO OPERAI ED ALTRI \n - 2)  DETTAGLIO PERSONALE DIPENDENTE: ORE / ANNO IMPIEGATE SUL PROGETTO \n - Numero ore di lavoro complessivamente svolte da tutto il personale aziendale   (B) \n - 5.1) COSTI INDIRETTI: PERSONALE INDIRETTO (Importi in migliaia di euro) \n - 5.3) COSTI INDIRETTI: SPESE GENERALI E DI FUNZIONAMENTO (Importi in migliaia di euro) \n"},{"$f":"CONCATENATE(X22,X23,ALL_C_PERSONALE!AB101)","v":""}]

{"sheet":"ALL_C_PERSONALE","index":7,"n_rows":101,"n_cols":38,"rows_kept":101,"cut":false,"hidden":true,"merged":[[70,2,71,3],[85,2,85,3],[83,2,83,3],[76,2,76,3],[73,2,73,3],[77,2,77,3],[74,2,74,3],[81,2,81,3],[78,2,78,3],[75,2,75,19],[82,2,82,3],[80,2,80,19],[72,2,72,19],[0,37,4,37],[0,2,3,2],[70,4,71,4],[54,2,54,3],[46,2,46,19],[48,2,48,3],[49,2,49,3],[6,3,6,6],[18,2,19,2],[14,3,15,4],[18,3,19,3],[40,2,40,3],[42,2,42,3],[55,2,55,3],[65,2,65,3],[70,5,70,19],[98,2,98,3],[87,2,87,3],[89,2,89,3],[92,2,92,19],[93,2,94,3],[97,2,97,3],[93,4,94,4],[96,2,96,3],[95,2,95,3],[93,5,93,19],[38,5,38,19],[41,2,41,3],[64,2,64,3],[43,2,43,3],[35,2,35,3],[53,2,53,19],[63,2,63,3],[60,2,60,19],[61,2,62,3],[56,2,56,3],[61,4,62,4],[61,5,61,19],[69,2,69,19],[0,3,0,19],[50,2,50,3],[38,4,39,4],[38,2,39,3],[37,2,37,19],[10,2,10,19],[8,2,8,19],[9,2,9,19],[12,5,12,19],[12,3,13,4],[12,2,13,2],[18,4,19,4],[3,3,3,19],[4,3,4,19],[17,2,17,19],[0,25,4,25],[0,26,4,26],[33,2,34,2],[31,2,32,2],[0,36,4,36],[25,2,25,4],[18,5,18,19],[28,2,29,2],[23,2,24,2],[21,2,22,2],[28,4,29,4],[28,5,28,19],[27,2,27,19],[28,3,29,3],[0,27,4,27],[1,3,1,19]]}
[null,null,"Ministero dello\nSviluppo economico",null,null,null,null,null,null,null,null,null,null,null,null,null,null,null,null,null,null,null,null,null,null,"fin.to L. 808/85","check compilazione","check coerenza",null,null,null,null,null,null,null,null,"ANNO_INIZIO","ANNO_FINE"]
[null,null,null,{"$f":"MENU!B5","v":"Direzione generale per la politica industriale, la competitività e le PMI"}]
[]
[null,null,null,{"$f":"MENU!B7","v":"Divisione IX “Industrie aerospazio,  difesa e sicurezza”"}]
[null,null,"Torna al menu principale","DOMANDA DI ACCESSO AI PROGETTI DI RICERCA E SVILUPPO EX. L. 808/85\n- ALLEGATO C: Previsioni di Costo del Programma: Costo del Personale -"]
[]
[null,null,"Legge 808/85 –  PROGETTO:",{"$f":"IF(ALL_A!$F$7=0,\"\",ALL_A!$F$7)","v":""},null,null,null,"Area:","Area:",null,null,null,null,null,null,null,null,null,null,{"$f":"ALL_A!I7","v":"Civile"},null,null,null,null,null,{"$f":"ALL_A!$E$9","v":"No"},null,null,null,null,null,null,null,null,null,null,{"$f":"ALL_A!$F$16","v":0},{"$f":"ALL_A!$G$16","v":0}]
[]
[null,null,"1)  DETERMINAZIONE COSTO ORARIO PERSONALE DIPENDENTE"]
[null,null,"Inserire nel prospetto sottostante il costo orario medio per categoria di personale ed annualità ed esplicitare la relativa metodologia di calcolo relativa al personale dipendente."]
[null,null,"TABELLA COSTO ORARIO AZIENDALE"]
[]
[null,null,"PERSONALE DIPENDENTE","METODOLOGIA DI CALCOLO",null,"COSTO ORARIO MEDIO (Euro / ora)"]
[null,null,null,null,null,{"$f":"ALL_C!E15","v":0},{"$f":"F14+1","v":1},2,3,4,5,6,7,8,9,10,11,12,13,14]
["X",null,"RICERCATORI /TECNICI","  Retribuzione media lorda  \nN. ore lavorative nell'anno",null,null,null,null,null,null,null,null,null,null,null,null,null,null,null,null,null,null,null,null,null,null,{"$f":"IF(AND(SUM(F15:T15)=0,A15<>\"\"),\" - 1) COSTO ORARIO MEDIO \"&C15&\" \n\",\"\")","v":" - 1) COSTO ORARIO MEDIO RICERCATORI /TECNICI \n"}]
["X",null,"OPERAI ED ALTRI",null,null,null,null,null,null,null,null,null,null,null,null,null,null,null,null,null,null,null,null,null,null,null,{"$f":"IF(AND(SUM(F16,T16)=0,A16<>\"\"),\" - 1) COSTO ORARIO MEDIO \"&C16&\" \n\",\"\")","v":" - 1) COSTO ORARIO MEDIO OPERAI ED ALTRI \n"}]
[null,null,{"$f":"ALL_C!F10","v":""}]
[null,null,"2)  DETTAGLIO PERSONALE DIPENDENTE: ORE / ANNO IMPIEGATE SUL PROGETTO"]
[null,null,"FASE DI ATTIVITÀ","PERSONALE DIPENDENTE","N° ORE TOTALI","TOTALE ORE / ANNO"]
[null,null,null,null,null,{"$f":"$F$14","v":0},{"$f":"F20+1","v":1},{"$f":"G20+1","v":2},3,4,5,6,7,8,9,10,11,12,13,14]
[null,null,"STUDI DI FATTIBILITA' TECNICA","RICERCATORI /TECNICI",{"$f":"SUM(F21:T21)","v":0}]
[null,null,"RICERCA INDUSTRIALE","RICERCATORI /TECNICI",{"$f":"SUM(F22:T22)","v":0}]
[null,null,null,"OPERAI ED ALTRI",{"$f":"SUM(F23:T23)","v":0}]
[null,null,"SVILUPPO SPERIMENTALE","RICERCATORI /TECNICI",{"$f":"SUM(F24:T24)","v":0}]
[null,null,null,"OPERAI ED ALTRI",{"$f":"SUM(F25:T25)","v":0}]
["X",null,"TOTALE ORE / ANNO PERSONALE DIPENDENTE",null,null,{"$f":"SUM(F21:F25)","v":0},{"$f":"SUM(G21:G25)","v":0},0,0,0,0,0,0,0,0,0,0,0,0,0,null,null,null,null,null,null,{"$f":"IF(AND(SUM(F26:T26)=0,A26<>\"\"),\" - \"&C18&\" \n\",\"\")","v":" - 2)  DETTAGLIO PERSONALE DIPENDENTE: ORE / ANNO IMPIEGATE SUL PROGETTO \n"}]
[]
[null,null,"3)  COSTI PERSONALE DIPENDENTE (migliaia di euro)"]
[null,null,"FASE DI ATTIVITÀ","PERSONALE DIPENDENTE","COSTO TOTALE","TOTALE COSTI / ANNO"]
[null,null,null,null,null,{"$f":"$F$14","v":0},{"$f":"F30+1","v":1},{"$f":"G30+1","v":2},3,4,5,6,7,8,9,10,11,12,13,14]
[null,null,"STUDI DI FATTIBILITA' TECNICA","RICERCATORI /TECNICI",{"$f":"SUM(F31:T31)","v":0},{"$f":"SUM(IF($D31=$C$15:$C$16,IF($F$14:$T$14=F$30,$F$15:$T$16)))*F21/1000","v":0},{"$f":"SUM(IF($D31=$C$15:$C$16,IF($F$14:$T$14=G$30,$F$15:$T$16)))*G21/1000","v":0},{"$f":"SUM(IF($D31=$C$15:$C$16,IF($F$14:$T$14=H$30,$F$15:$T$16)))*H21/1000","v":0},{"$f":"SUM(IF($D31=$C$15:$C$16,IF($F$14:$T$14=I$30,$F$15:$T$16)))*I21/1000","v":0},{"$f":"SUM(IF($D31=$C$15:$C$16,IF($F$14:$T$14=J$30,$F$15:$T$16)))*J21/1000","v":0},{"$f":"SUM(IF($D31=$C$15:$C$16,IF($F$14:$T$14=K$30,$F$15:$T$16)))*K21/1000","v":0},{"$f":"SUM(IF($D31=$C$15:$C$16,IF($F$14:$T$14=L$30,$F$15:$T$16)))*L21/1000","v":0},{"$f":"SUM(IF($D31=$C$15:$C$16,IF($F$14:$T$14=M$30,$F$15:$T$16)))*M21/1000","v":0},{"$f":"SUM(IF($D31=$C$15:$C$16,IF($F$14:$T$14=N$30,$F$15:$T$16)))*N21/1000","v":0},{"$f":"SUM(IF($D31=$C$15:$C$16,IF($F$14:$T$14=O$30,$F$15:$T$16)))*O21/1000","v":0},{"$f":"SUM(IF($D31=$C$15:$C$16,IF($F$14:$T$14=P$30,$F$15:$T$16)))*P21/1000","v":0},{"$f":"SUM(IF($D31=$C$15:$C$16,IF($F$14:$T$14=Q$30,$F$15:$T$16)))*Q21/1000","v":0},{"$f":"SUM(IF($D31=$C$15:$C$16,IF($F$14:$T$14=R$30,$F$15:$T$16)))*R21/1000","v":0},{"$f":"SUM(IF($D31=$C$15:$C$16,IF($F$14:$T$14=S$30,$F$15:$T$16)))*S21/1000","v":0},{"$f":"SUM(IF($D31=$C$15:$C$16,IF($F$14:$T$14=T$30,$F$15:$T$16)))*T21/1000","v":0}]
[null,null,"RICERCA INDUSTRIALE","RICERCATORI /TECNICI",{"$f":"SUM(F32:T32)","v":0},{"$f":"SUM(IF($D32=$C$15:$C$16,IF($F$14:$T$14=F$30,$F$15:$T$16)))*F22/1000","v":0},{"$f":"SUM(IF($D32=$C$15:$C$16,IF($F$14:$T$14=G$30,$F$15:$T$16)))*G22/1000","v":0},{"$f":"SUM(IF($D32=$C$15:$C$16,IF($F$14:$T$14=H$30,$F$15:$T$16)))*H22/1000","v":0},{"$f":"SUM(IF($D32=$C$15:$C$16,IF($F$14:$T$14=I$30,$F$15:$T$16)))*I22/1000","v":0},{"$f":"SUM(IF($D32=$C$15:$C$16,IF($F$14:$T$14=J$30,$F$15:$T$16)))*J22/1000","v":0},{"$f":"SUM(IF($D32=$C$15:$C$16,IF($F$14:$T$14=K$30,$F$15:$T$16)))*K22/1000","v":0},{"$f":"SUM(IF($D32=$C$15:$C$16,IF($F$14:$T$14=L$30,$F$15:$T$16)))*L22/1000","v":0},{"$f":"SUM(IF($D32=$C$15:$C$16,IF($F$14:$T$14=M$30,$F$15:$T$16)))*M22/1000","v":0},{"$f":"SUM(IF($D32=$C$15:$C$16,IF($F$14:$T$14=N$30,$F$15:$T$16)))*N22/1000","v":0},{"$f":"SUM(IF($D32=$C$15:$C$16,IF($F$14:$T$14=O$30,$F$15:$T$16)))*O22/1000","v":0},{"$f":"SUM(IF($D32=$C$15:$C$16,IF($F$14:$T$14=P$30,$F$15:$T$16)))*P22/1000","v":0},{"$f":"SUM(IF($D32=$C$15:$C$16,IF($F$14:$T$14=Q$30,$F$15:$T$16)))*Q22/1000","v":0},{"$f":"SUM(IF($D32=$C$15:$C$16,IF($F$14:$T$14=R$30,$F$15:$T$16)))*R22/1000","v":0},{"$f":"SUM(IF($D32=$C$15:$C$16,IF($F$14:$T$14=S$30,$F$15:$T$16)))*S22/1000","v":0},{"$f":"SUM(IF($D32=$C$15:$C$16,IF($F$14:$T$14=T$30,$F$15:$T$16)))*T22/1000","v":0}]
[null,null,null,"OPERAI ED ALTRI",{"$f":"SUM(F33:T33)","v":0},{"$f":"SUM(IF($D33=$C$15:$C$16,IF($F$14:$T$14=F$30,$F$15:$T$16)))*F23/1000","v":0},{"$f":"SUM(IF($D33=$C$15:$C$16,IF($F$14:$T$14=G$30,$F$15:$T$16)))*G23/1000","v":0},{"$f":"SUM(IF($D33=$C$15:$C$16,IF($F$14:$T$14=H$30,$F$15:$T$16)))*H23/1000","v":0},{"$f":"SUM(IF($D33=$C$15:$C$16,IF($F$14:$T$14=I$30,$F$15:$T$16)))*I23/1000","v":0},{"$f":"SUM(IF($D33=$C$15:$C$16,IF($F$14:$T$14=J$30,$F$15:$T$16)))*J23/1000","v":0},{"$f":"SUM(IF($D33=$C$15:$C$16,IF($F$14:$T$14=K$30,$F$15:$T$16)))*K23/1000","v":0},{"$f":"SUM(IF($D33=$C$15:$C$16,IF($F$14:$T$14=L$30,$F$15:$T$16)))*L23/1000","v":0},{"$f":"SUM(IF($D33=$C$15:$C$16,IF($F$14:$T$14=M$30,$F$15:$T$16)))*M23/1000","v":0},{"$f":"SUM(IF($D33=$C$15:$C$16,IF($F$14:$T$14=N$30,$F$15:$T$16)))*N23/1000","v":0},{"$f":"SUM(IF($D33=$C$15:$C$16,IF($F$14:$T$14=O$30,$F$15:$T$16)))*O23/1000","v":0},{"$f":"SUM(IF($D33=$C$15:$C$16,IF($F$14:$T$14=P$30,$F$15:$T$16)))*P23/1000","v":0},{"$f":"SUM(IF($D33=$C$15:$C$16,IF($F$14:$T$14=Q$30,$F$15:$T$16)))*Q23/1000","v":0},{"$f":"SUM(IF($D33=$C$15:$C$16,IF($F$14:$T$14=R$30,$F$15:$T$16)))*R23/1000","v":0},{"$f":"SUM(IF($D33=$C$15:$C$16,IF($F$14:$T$14=S$30,$F$15:$T$16)))*S23/1000","v":0},{"$f":"SUM(IF($D33=$C$15:$C$16,IF($F$14:$T$14=T$30,$F$15:$T$16)))*T23/1000","v":0}]
[null,null,"SVILUPPO SPERIMENTALE","RICERCATORI /TECNICI",{"$f":"SUM(F34:T34)","v":0},{"$f":"SUM(IF($D34=$C$15:$C$16,IF($F$14:$T$14=F$30,$F$15:$T$16)))*F24/1000","v":0},{"$f":"SUM(IF($D34=$C$15:$C$16,IF($F$14:$T$14=G$30,$F$15:$T$16)))*G24/1000","v":0},{"$f":"SUM(IF($D34=$C$15:$C$16,IF($F$14:$T$14=H$30,$F$15:$T$16)))*H24/1000","v":0},{"$f":"SUM(IF($D34=$C$15:$C$16,IF($F$14:$T$14=I$30,$F$15:$T$16)))*I24/1000","v":0},{"$f":"SUM(IF($D34=$C$15:$C$16,IF($F$14:$T$14=J$30,$F$15:$T$16)))*J24/1000","v":0},{"$f":"SUM(IF($D34=$C$15:$C$16,IF($F$14:$T$14=K$30,$F$15:$T$16)))*K24/1000","v":0},{"$f":"SUM(IF($D34=$C$15:$C$16,IF($F$14:$T$14=L$30,$F$15:$T$16)))*L24/1000","v":0},{"$f":"SUM(IF($D34=$C$15:$C$16,IF($F$14:$T$14=M$30,$F$15:$T$16)))*M24/1000","v":0},{"$f":"SUM(IF($D34=$C$15:$C$16,IF($F$14:$T$14=N$30,$F$15:$T$16)))*N24/1000","v":0},{"$f":"SUM(IF($D34=$C$15:$C$16,IF($F$14:$T$14=O$30,$F$15:$T$16)))*O24/1000","v":0},{"$f":"SUM(IF($D34=$C$15:$C$16,IF($F$14:$T$14=P$30,$F$15:$T$16)))*P24/1000","v":0},{"$f":"SUM(IF($D34=$C$15:$C$16,IF($F$14:$T$14=Q$30,$F$15:$T$16)))*Q24/1000","v":0},{"$f":"SUM(IF($D34=$C$15:$C$16,IF($F$14:$T$14=R$30,$F$15:$T$16)))*R24/1000","v":0},{"$f":"SUM(IF($D34=$C$15:$C$16,IF($F$14:$T$14=S$30,$F$15:$T$16)))*S24/1000","v":0},{"$f":"SUM(IF($D34=$C$15:$C$16,IF($F$14:$T$14=T$30,$F$15:$T$16)))*T24/1000","v":0}]
["X",null,null,"OPERAI ED ALTRI",{"$f":"SUM(F35:T35)","v":0},{"$f":"SUM(IF($D35=$C$15:$C$16,IF($F$14:$T$14=F$30,$F$15:$T$16)))*F25/1000","v":0},{"$f":"SUM(IF($D35=$C$15:$C$16,IF($F$14:$T$14=G$30,$F$15:$T$16)))*G25/1000","v":0},{"$f":"SUM(IF($D35=$C$15:$C$16,IF($F$14:$T$14=H$30,$F$15:$T$16)))*H25/1000","v":0},{"$f":"SUM(IF($D35=$C$15:$C$16,IF($F$14:$T$14=I$30,$F$15:$T$16)))*I25/1000","v":0},{"$f":"SUM(IF($D35=$C$15:$C$16,IF($F$14:$T$14=J$30,$F$15:$T$16)))*J25/1000","v":0},{"$f":"SUM(IF($D35=$C$15:$C$16,IF($F$14:$T$14=K$30,$F$15:$T$16)))*K25/1000","v":0},{"$f":"SUM(IF($D35=$C$15:$C$16,IF($F$14:$T$14=L$30,$F$15:$T$16)))*L25/1000","v":0},{"$f":"SUM(IF($D35=$C$15:$C$16,IF($F$14:$T$14=M$30,$F$15:$T$16)))*M25/1000","v":0},{"$f":"SUM(IF($D35=$C$15:$C$16,IF($F$14:$T$14=N$30,$F$15:$T$16)))*N25/1000","v":0},{"$f":"SUM(IF($D35=$C$15:$C$16,IF($F$14:$T$14=O$30,$F$15:$T$16)))*O25/1000","v":0},{"$f":"SUM(IF($D35=$C$15:$C$16,IF($F$14:$T$14=P$30,$F$15:$T$16)))*P25/1000","v":0},{"$f":"SUM(IF($D35=$C$15:$C$16,IF($F$14:$T$14=Q$30,$F$15:$T$16)))*Q25/1000","v":0},{"$f":"SUM(IF($D35=$C$15:$C$16,IF($F$14:$T$14=R$30,$F$15:$T$16)))*R25/1000","v":0},{"$f":"SUM(IF($D35=$C$15:$C$16,IF($F$14:$T$14=S$30,$F$15:$T$16)))*S25/1000","v":0},{"$f":"SUM(IF($D35=$C$15:$C$16,IF($F$14:$T$14=T$30,$F$15:$T$16)))*T25/1000","v":0}]
[null,null,"TOTALE COSTO PERSONALE DIPENDENTE",null,{"$f":"SUM(E31:E35)","v":0},{"$f":"SUM(F31:F35)","v":0},0,0,0,0,0,0,0,0,0,0,0,0,0,0]
[]
[null,null,"4)  COSTI PERSONALE NON DIPENDENTE (migliaia di euro)"]
[null,null,"FASE DI ATTIVITA'",null,"COSTO TOTALE","TOTALE COSTI / ANNO"]
[null,null,null,null,null,{"$f":"$F$14","v":0},{"$f":"F40+1","v":1},{"$f":"G40+1","v":2},{"$f":"H40+1","v":3},4,5,6,7,8,9,10,11,12,13,14]
[null,null,"STUDI DI FATTIBILITA' TECNICA",null,{"$f":"SUM(F41:T41)","v":0}]
[null,null,"RICERCA INDUSTRIALE ",null,{"$f":"SUM(F42:T42)","v":0}]
[null,null,"SVILUPPO SPERIMENTALE",null,{"$f":"SUM(F43:T43)","v":0}]
[null,null,"TOTALE COSTO PERSONALE NON DIPENDENTE",null,{"$f":"SUM(E41:E43)","v":0},{"$f":"SUM(F41:F43)","v":0},{"$f":"SUM(G41:G43)","v":0},0,0,0,0,0,0,0,0,0,0,0,0,0,null,null,null,null,null,null,{"$f":"IF(AND(SUM(F44:T44)=0,A44<>\"\"),\" - \"&C38&\" \n\",\"\")","v":""}]
[null,null,{"$f":"IF(OR(F44>0.15*F36,G44>0.15*G36,H44>0.15*H36,T44>0.15*T36),\"ATTENZIONE: il costo del personale non dipendente non può superare il 15% del costo del personale dipendente per lo stesso anno/periodo.\",\"\")","v":""},null,null,null,null,null,null,null,null,null,null,null,null,null,null,null,null,null,null,null,null,null,null,null,null,{"$f":"IF(AND(C45<>\"\",A44<>\"\"),\" - \"&C45&\" \n\",\"\")","v":""}]
[]
[null,null,"5)  CALCOLO QUOTA COSTI INDIRETTI"]
[null,null,null,null,"TOTALE",{"$f":"$F$14","v":0},{"$f":"F48+1","v":1},{"$f":"G48+1","v":2},{"$f":"H48+1","v":3},4,5,6,7,8,9,10,11,12,13,14]
[null,null,"Numero ore di lavoro dedicate nell'esercizio di riferimento alla realizzazione del progetto  (A)",null,{"$f":"SUM(F49:T49)","v":0},{"$f":"F26","v":0},{"$f":"G26","v":0},0,0,0,0,0,0,0,0,0,0,0,0,0]
[null,null,"Numero ore di lavoro complessivamente svolte da tutto il personale aziendale   (B)",null,{"$f":"SUM(F50:T50)","v":0}]
["X",null,"Rapporto per determinare la quota imputabile dei Costi Indiretti   (A/B)",null,null,{"$f":"IF(F50=0,0,F49/F50)","v":0},{"$f":"IF(G50=0,0,G49/G50)","v":0},{"$f":"IF(H50=0,0,H49/H50)","v":0},{"$f":"IF(I50=0,0,I49/I50)","v":0},0,0,0,0,0,0,0,0,0,0,0,null,null,null,null,null,null,{"$f":"IF(AND(SUM(F51:T51)=0,A51<>\"\"),\" - \"&C50&\" \n\",\"\")","v":" - Numero ore di lavoro complessivamente svolte da tutto il personale aziendale   (B) \n"}]
[]
[]
[null,null,"5.1) COSTI INDIRETTI: PERSONALE INDIRETTO (Importi in migliaia di euro)"]
[null,null,"Personale per: amministrazione e finanza, controllo di gestione, personale ed organizzazione, acquisti e sistemi informativi",null,"TOTALE",{"$f":"$F$14","v":0},{"$f":"F55+1","v":1},{"$f":"G55+1","v":2},{"$f":"H55+1","v":3},{"$f":"I55+1","v":4},5,6,7,8,9,10,11,12,13,14]
[null,null,"Numero unità"]
["X",null,"Costo Totale",null,null,null,null,null,null,null,null,null,null,null,null,null,null,null,null,null,null,null,null,null,null,null,{"$f":"IF(AND(SUM(F57:T57)=0,A57<>\"\"),\" - \"&C54&\" \n\",\"\")","v":" - 5.1) COSTI INDIRETTI: PERSONALE INDIRETTO (Importi in migliaia di euro) \n"}]
[null,null,"QUOTA IMPUTABILE",null,{"$f":"SUM(F58:T58)","v":0},{"$f":"IF(F$51<>\"\",F$51*F57,0)","v":0},{"$f":"IF(G$51<>\"\",G$51*G57,0)","v":0},0,0,0,0,0,0,0,0,0,0,0,0,0]
[]
[]
[null,null,"5.2) COSTI INDIRETTI: AMMORTAMENTI (Importi in migliaia di euro)"]
[null,null,"Quota ammort. contabile, al netto di rivalutazioni dei cespiti",null,"COSTO TOTALE","TOTALE COSTI / ANNO"]
[null,null,null,null,null,{"$f":"$F$14","v":0},{"$f":"F63+1","v":1},{"$f":"G63+1","v":2},{"$f":"H63+1","v":3},4,5,6,7,8,9,10,11,12,13,14]
[null,null,"Beni materiali",null,{"$f":"SUM(F64:T64)","v":0},null,null,null,null,null,null,null,null,null,null,null,null,null,null,null,{"$f":"IF(SUM(F67:T67)>0,\"ATTENZIONE: per i periodi segnalati il \" &C66&\" supera il rapporto teorico per il calcolo della quota imputabile di costi indiretti\",\"\")","v":""}]
[null,null,"Beni immateriali",null,{"$f":"SUM(F65:T65)","v":0}]
[null,null,"Totale Ammortamenti imputabili a progetto",null,{"$f":"SUM(F66:T66)","v":0},{"$f":"SUM(F64:F65)","v":0},{"$f":"SUM(G64:G65)","v":0},0,0,0,0,0,0,0,0,0,0,0,0,0,null,null,null,null,null,null,{"$f":"IF(AND(SUM(F66:T66)=0,A66<>\"\"),\" - \"&C61&\" \n\",\"\")","v":""}]
[null,null,null,null,null,null,null,null,null,null,null,null,null,null,null,null,null,null,null,null,null,null,null,null,null,null,null,{"$f":"IF(AND(SUM(F67:T67)>0,A67<>\"\"),\" - \"&C62&\" \n\",\"\")","v":""}]
[]
[]
[null,null,"5.3) COSTI INDIRETTI: SPESE GENERALI E DI FUNZIONAMENTO (Importi in migliaia di euro)"]
[null,null,"Spese Generali e di Funzionamento",null,"COSTO TOTALE","TOTALE COSTI / ANNO",null,null,null,null,null,null,null,null,null,null,null,null,null,null,null,null,null,null,null,null,null,null,{"$f":"AB67","v":""}]
[null,null,null,null,null,{"$f":"$F$14","v":0},{"$f":"F72+1","v":1},{"$f":"G72+1","v":2},{"$f":"H72+1","v":3},4,5,6,7,8,9,10,11,12,13,14]
[null,null,"Utenze: Energia Elettrica, Acqua, Combustibili  e Fluidi per impianti"]
[null,null,"Totale Utenze",null,{"$f":"SUM(F74:T74)","v":0}]
[null,null,"QUOTA IMPUTABILE A PROGETTO",null,0,{"$f":"IF(F$51<>\"\",F$51*F74,0)","v":0},{"$f":"IF(G$51<>\"\",G$51*G74,0)","v":0},0,0,0,0,0,0,0,0,0,0,0,0,0]
[null,null,"Manutenzione"]
[null,null,"Immobili",null,0,null,null,null,null,null,null,null,null,null,null,null,null,null,null,null,{"$f":"IF(SUM(F80:T80)>0,\"ATTENZIONE: per i periodi segnalati il \" &C79&\" supera il rapporto teorico per il calcolo della quota imputabile di costi indiretti\",\"\")","v":""}]
[null,null,"Macchinari - Impianti",null,0]
[null,null,"Totale Costi di Manutenzione imputabili a progetto",null,0,{"$f":"SUM(F77:F78)","v":0},{"$f":"SUM(G77:G78)","v":0},0,0,0,0,0,0,0,0,0,0,0,0,0]
[null,null,null,null,null,null,null,null,null,null,null,null,null,null,null,null,null,null,null,null,null,null,null,null,null,null,null,{"$f":"IF(AND(SUM(F80:T80)>0,A80<>\"\"),\" - \"&C76&\" \n\",\"\")","v":""}]
[null,null,"Affitti e canoni"]
[null,null,"Affitti",null,{"$f":"SUM(F82:T82)","v":0},null,null,null,null,null,null,null,null,null,null,null,null,null,null,null,{"$f":"IF(SUM(F85:T85)>0,\"ATTENZIONE: per i periodi segnalati il \" &C84&\" supera il rapporto teorico per il calcolo della quota imputabile di costi indiretti\",\"\")","v":""}]
[null,null,"Leasing",null,{"$f":"SUM(F83:T83)","v":0}]
[null,null,"Totale costi per Affitti e Leasing imputabili a progetto",null,{"$f":"SUM(E82:E83)","v":0},{"$f":"SUM(F82:F83)","v":0},{"$f":"SUM(G82:G83)","v":0},0,0,0,0,0,0,0,0,0,0,0,0,0]
[null,null,null,null,null,null,null,null,null,null,null,null,null,null,null,null,null,null,null,null,null,null,null,null,null,null,null,{"$f":"IF(AND(SUM(F85:T85)>0,A85<>\"\"),\" - \"&C81&\" \n\",\"\")","v":""}]
["X",null,"Totale Spese Generali e di Funzionamento imputabili a progetto",null,{"$f":"E84+E79+E75","v":0},0,0,0,0,0,0,0,0,0,0,0,0,0,0,0,null,null,null,null,null,null,{"$f":"IF(AND(SUM(F86:T86)=0,A86<>\"\"),\" - \"&C70&\" \n\",\"\")","v":" - 5.3) COSTI INDIRETTI: SPESE GENERALI E DI FUNZIONAMENTO (Importi in migliaia di euro) \n"}]
[]
[null,null,"5. TOTALE COSTI INDIRETTI IMPUTABILI A PROGETTO",null,{"$f":"E86+E66+E58","v":0},{"$f":"F86+F66+F58","v":0},{"$f":"G86+G66+G58","v":0},0,0,0,0,0,0,0,0,0,0,0,0,0]
[]
[null,null,"TOTALE PERSONALE E COSTI INDIRETTI",null,{"$f":"E88+E44+E36","v":0},0,0,0,0,0,0,0,0,0,0,0,0,0,0,0]
[]
[]
[null,null,"TOTALE PERSONALE E COSTI INDIRETTI PER ATTIVITA'"]
[null,null,"FASE DI ATTIVITA'",null,"COSTO TOTALE","TOTALE COSTI / ANNO"]
[null,null,null,null,null,{"$f":"$F$14","v":0},{"$f":"F95+1","v":1},{"$f":"G95+1","v":2},{"$f":"H95+1","v":3},4,5,6,7,8,9,10,11,12,13,14]
[null,null,"STUDI DI FATTIBILITA' TECNICA",null,{"$f":"SUM(F96:T96)","v":0},{"$f":"F31+F41+IF(F$36<>0,(F88*F31/F$36),0)","v":0},{"$f":"G31+G41+IF(G$36<>0,(G88*G31/G$36),0)","v":0},0,0,0,0,0,0,0,0,0,0,0,0,0]
[null,null,"RICERCA INDUSTRIALE ",null,{"$f":"SUM(F97:T97)","v":0},{"$f":"F32+F33+F42+IF(F$36<>0,(F88*(F32+F33)/F$36),0)","v":0},{"$f":"G32+G33+G42+IF(G$36<>0,(G88*(G32+G33)/G$36),0)","v":0},0,0,0,0,0,0,0,0,0,0,0,0,0]
[null,null,"SVILUPPO SPERIMENTALE",null,{"$f":"SUM(F98:T98)","v":0},{"$f":"F34+F35+F43+IF(F$36<>0,(F88*(F35+F34)/F$36),0)","v":0},{"$f":"G34+G35+G43+IF(G$36<>0,(G88*(G35+G34)/G$36),0)","v":0},0,0,0,0,0,0,0,0,0,0,0,0,0]
[null,null,"TOTALE PERSONALE E COSTI INDIRETTI PER ATTIVITA'",null,{"$f":"SUM(F99:T99)","v":0},{"$f":"SUM(F96:F98)","v":0},{"$f":"SUM(G96:G98)","v":0},{"$f":"SUM(H96:H98)","v":0},{"$f":"SUM(I96:I98)","v":0},{"$f":"SUM(J96:J98)","v":0},0,0,0,0,0,0,0,0,0,0]
[]
[null,null,null,null,null,null,null,null,null,null,null,null,null,null,null,null,null,null,null,null,null,null,null,null,null,null,{"$f":"CONCATENATE(AA15,AA16,AA26,AA44,AA51,AA57,AA66,AA86)","v":" - 1) COSTO ORARIO MEDIO RICERCATORI /TECNICI \n - 1) COSTO ORARIO MEDIO OPERAI ED ALTRI \n - 2)  DETTAGLIO PERSONALE DIPENDENTE: ORE / ANNO IMPIEGATE SUL PROGETTO \n - Numero ore di lavoro complessivamente svolte da tutto il personale aziendale   (B) \n - 5.1) COSTI INDIRETTI: PERSONALE INDIRETTO (Importi in migliaia di euro) \n - 5.3) COSTI INDIRETTI: SPESE GENERALI E DI FUNZIONAMENTO (Importi in migliaia di euro) \n"},{"$f":"CONCATENATE(AB45,AB67,AB80,AB85)","v":""}]

{"sheet":"ALL_C_IMPRESE_ASSOCIATE","index":8,"n_rows":313,"n_cols":14,"rows_kept":313,"cut":false,"hidden":true,"merged":[[0,11,4,11],[0,12,4,12],[0,13,4,13],[1,3,1,9],[3,3,3,9],[4,3,4,9],[10,2,10,9],[6,3,6,7],[175,2,175,9],[306,2,306,8],[0,2,4,2],[0,3,0,9]]}
[null,null,"Torna al menu principale","Dipartimento per l’Impresa e l’Internazionalizzazione",null,null,null,null,null,null,null,"fin.to L. 808/85","check compilazione","check coerenza"]
[null,null,null,"Direzione generale per la politica industriale e la competitività"]
[]
[null,null,null,"Divisione VIII – “Industria dell'aerospazio e della difesa”"]
[null,null,null,"DOMANDA DI ACCESSO AI PROGETTI DI RICERCA E SVILUPPO EX. L. 808/85\n- ALLEGATO C: Previsioni di Costo del Programma: sintesi per imprese associate -"]
[]
[null,null,"Legge 808/85 – PROGRAMMA:",{"$f":"IF(ALL_A!$F$7=0,\"\",ALL_A!$F$7)","v":""},null,null,null,null,"Area:",{"$f":"ALL_A!$I$7","v":"Civile"},null,{"$f":"ALL_A!$E$9","v":"No"}]
[]
[null,null,null,null,null,null,null,null,null,"(Importi in migliaia Euro)"]
[]
[null,null,"A) PREVISIONE DEI COSTI DELLE ATTIVITA' PER I PROGRAMMI PRESENTATI IN FORMA ASSOCIATA (Per tipo di costo)"]
[]
[null,null," TIPO DI COSTO",null,{"$f":"IF($L$7=\"Si\",2012,2014)","v":2014},{"$f":"E13+1","v":2015},{"$f":"F13+1","v":2016},{"$f":"\"TOTALE\n\"&IF($L$7=\"Si\",\" AL \",E13&\"-\") &G13","v":"TOTALE\n2014-2016"},"SUCCESSIVI \nA FINIRE","TOTALE\nGENER."]
[null,null,"COSTI PER IL PERSONALE"]
[null,null,{"$f":"ALL_A!$C$47","v":0},null,{"$f":"ALL_C!E16","v":0},{"$f":"ALL_C!F16","v":0},{"$f":"ALL_C!Q16","v":0},{"$f":"IF($L$7=\"Si\",SUM(D15:G15),SUM(E15:G15))","v":0},{"$f":"ALL_C!S16","v":0},{"$f":"H15+I15","v":0}]
[null,null,{"$f":"IF(ALL_A!C48=\"\",\"\",ALL_A!C48)","v":""},null,null,null,null,{"$f":"IF($L$7=\"Si\",SUM(D16:G16),SUM(E16:G16))","v":0},null,{"$f":"H16+I16","v":0}]
[null,null,{"$f":"IF(ALL_A!C49=\"\",\"\",ALL_A!C49)","v":""},null,null,null,null,{"$f":"IF($L$7=\"Si\",SUM(D17:G17),SUM(E17:G17))","v":0},null,{"$f":"H17+I17","v":0}]
[null,null,{"$f":"IF(ALL_A!C50=\"\",\"\",ALL_A!C50)","v":""},null,null,null,null,{"$f":"IF($L$7=\"Si\",SUM(D18:G18),SUM(E18:G18))","v":0},null,{"$f":"H18+I18","v":0}]
[null,null,{"$f":"IF(ALL_A!C51=\"\",\"\",ALL_A!C51)","v":""},null,null,null,null,0,null,0]
[null,null,null,null,null,null,null,0,null,0]
[null,null,null,null,null,null,null,0,null,0]
[null,null,null,null,null,null,null,0,null,0]
[null,null,null,null,null,null,null,0,null,0]
[null,null,null,null,null,null,null,0,null,0]
[null,null,null,null,null,null,null,0,null,0]
[null,null,null,null,null,null,null,0,null,0]
[null,null,null,null,null,null,null,0,null,0]
[null,null,null,null,null,null,null,0,null,0]
[null,null,null,null,null,null,null,0,null,0]
[null,null,null,null,null,null,null,0,null,0]
[null,null,null,null,null,null,null,0,null,0]
[null,null,null,null,null,null,null,0,null,0]
[null,null,null,null,null,null,null,0,null,0]
[null,null,null,null,null,null,null,0,null,0]
[null,null,null,null,null,null,null,0,null,0]
[null,null,null,null,null,null,null,0,null,0]
[null,null,null,null,null,null,null,0,null,0]
[null,null,null,null,null,null,null,0,null,0]
[null,null,null,null,null,null,null,0,null,0]
[null,null,null,null,null,null,null,0,null,0]
[null,null,null,null,null,null,null,0,null,0]
[null,null,null,null,null,null,null,0,null,0]
[null,null,null,null,null,null,null,{"$f":"IF($L$7=\"Si\",SUM(D43:G43),SUM(E43:G43))","v":0},null,{"$f":"H43+I43","v":0}]
[null,null,null,null,null,null,null,{"$f":"IF($L$7=\"Si\",SUM(D44:G44),SUM(E44:G44))","v":0},null,{"$f":"H44+I44","v":0}]
[null,1001,"TOTALE COSTO DEL PERSONALE",null,{"$f":"SUM(E15:E44)","v":0},0,0,0,0,0]
[null,null,"COSTI PER I MATERIALI"]
[null,null,{"$f":"C15","v":0},null,{"$f":"ALL_C!E19","v":0},{"$f":"ALL_C!F19","v":0},{"$f":"ALL_C!Q19","v":0},{"$f":"IF($L$7=\"Si\",SUM(D47:G47),SUM(E47:G47))","v":0},{"$f":"ALL_C!S19","v":0},{"$f":"H47+I47","v":0}]
[null,null,{"$f":"C16","v":""},null,null,null,null,{"$f":"IF($L$7=\"Si\",SUM(D48:G48),SUM(E48:G48))","v":0},null,{"$f":"H48+I48","v":0}]
[null,null,{"$f":"C17","v":""},null,null,null,null,{"$f":"IF($L$7=\"Si\",SUM(D49:G49),SUM(E49:G49))","v":0},null,{"$f":"H49+I49","v":0}]
[null,null,{"$f":"C18","v":""},null,null,null,null,{"$f":"IF($L$7=\"Si\",SUM(D50:G50),SUM(E50:G50))","v":0},null,{"$f":"H50+I50","v":0}]
[null,null,{"$f":"C19","v":""},null,null,null,null,{"$f":"IF($L$7=\"Si\",SUM(D51:G51),SUM(E51:G51))","v":0},null,{"$f":"H51+I51","v":0}]
[null,null,null,null,null,null,null,0,null,0]
[null,null,null,null,null,null,null,0,null,0]
[null,null,null,null,null,null,null,0,null,0]
[null,null,null,null,null,null,null,0,null,0]
[null,null,null,null,null,null,null,0,null,0]
[null,null,null,null,null,null,null,0,null,0]
[null,null,null,null,null,null,null,0,null,0]
[null,null,null,null,null,null,null,0,null,0]
[null,null,null,null,null,null,null,0,null,0]
[null,null,null,null,null,null,null,0,null,0]
[null,null,null,null,null,null,null,0,null,0]
[null,null,null,null,null,null,null,0,null,0]
[null,null,null,null,null,null,null,0,null,0]
[null,null,null,null,null,null,null,0,null,0]
[null,null,null,null,null,null,null,0,null,0]
[null,null,null,null,null,null,null,0,null,0]
[null,null,null,null,null,null,null,0,null,0]
[null,null,null,null,null,null,null,0,null,0]
[null,null,null,null,null,null,null,0,null,0]
[null,null,null,null,null,null,null,0,null,0]
[null,null,null,null,null,null,null,0,null,0]
[null,null,null,null,null,null,null,0,null,0]
[null,null,null,null,null,null,null,0,null,0]
[null,null,null,null,null,null,null,{"$f":"IF($L$7=\"Si\",SUM(D75:G75),SUM(E75:G75))","v":0},null,{"$f":"H75+I75","v":0}]
[null,null,null,null,null,null,null,{"$f":"IF($L$7=\"Si\",SUM(D76:G76),SUM(E76:G76))","v":0},null,{"$f":"H76+I76","v":0}]
[null,1001,"TOTALE MATERIALI",null,{"$f":"SUM(E47:E76)","v":0},0,0,0,0,0]
[null,null,"COSTI PER GLI STRUMENTI E LE ATTREZZATURE"]
[null,null,{"$f":"C47","v":0},null,{"$f":"ALL_C!E20","v":0},{"$f":"ALL_C!F20","v":0},{"$f":"ALL_C!Q20","v":0},{"$f":"IF($L$7=\"Si\",SUM(D79:G79),SUM(E79:G79))","v":0},{"$f":"ALL_C!S20","v":0},{"$f":"H79+I79","v":0}]
[null,null,{"$f":"C48","v":""},null,null,null,null,{"$f":"IF($L$7=\"Si\",SUM(D80:G80),SUM(E80:G80))","v":0},null,{"$f":"H80+I80","v":0}]
[null,null,{"$f":"C49","v":""},null,null,null,null,{"$f":"IF($L$7=\"Si\",SUM(D81:G81),SUM(E81:G81))","v":0},null,{"$f":"H81+I81","v":0}]
[null,null,{"$f":"C50","v":""},null,null,null,null,{"$f":"IF($L$7=\"Si\",SUM(D82:G82),SUM(E82:G82))","v":0},null,{"$f":"H82+I82","v":0}]
[null,null,{"$f":"C51","v":""},null,null,null,null,{"$f":"IF($L$7=\"Si\",SUM(D83:G83),SUM(E83:G83))","v":0},null,{"$f":"H83+I83","v":0}]
[null,null,null,null,null,null,null,0,null,0]
[null,null,null,null,null,null,null,0,null,0]
[null,null,null,null,null,null,null,0,null,0]
[null,null,null,null,null,null,null,0,null,0]
[null,null,null,null,null,null,null,0,null,0]
[null,null,null,null,null,null,null,0,null,0]
[null,null,null,null,null,null,null,0,null,0]
[null,null,null,null,null,null,null,0,null,0]
[null,null,null,null,null,null,null,0,null,0]
[null,null,null,null,null,null,null,0,null,0]
[null,null,null,null,null,null,null,0,null,0]
[null,null,null,null,null,null,null,0,null,0]
[null,null,null,null,null,null,null,0,null,0]
[null,null,null,null,null,null,null,0,null,0]
[null,null,null,null,null,null,null,0,null,0]
[null,null,null,null,null,null,null,0,null,0]
[null,null,null,null,null,null,null,0,null,0]
[null,null,null,null,null,null,null,0,null,0]
[null,null,null,null,null,null,null,0,null,0]
[null,null,null,null,null,null,null,0,null,0]
[null,null,null,null,null,null,null,0,null,0]
[null,null,null,null,null,null,null,0,null,0]
[null,null,null,null,null,null,null,0,null,0]
[null,null,null,null,null,null,null,{"$f":"IF($L$7=\"Si\",SUM(D107:G107),SUM(E107:G107))","v":0},null,{"$f":"H107+I107","v":0}]
[null,null,null,null,null,null,null,{"$f":"IF($L$7=\"Si\",SUM(D108:G108),SUM(E108:G108))","v":0},null,{"$f":"H108+I108","v":0}]
[null,1001,"TOTALE STRUMENTAZIONE E ATTREZZATURE",null,{"$f":"SUM(E79:E108)","v":0},0,0,0,0,0]
[null,null,"COSTI PER I SERVIZI DI CONSULENZA"]
[null,null,{"$f":"C79","v":0},null,{"$f":"ALL_C!E21","v":0},{"$f":"ALL_C!F21","v":0},{"$f":"ALL_C!Q21","v":0},{"$f":"IF($L$7=\"Si\",SUM(D111:G111),SUM(E111:G111))","v":0},{"$f":"ALL_C!S21","v":0},{"$f":"H111+I111","v":0}]
[null,null,{"$f":"C80","v":""},null,null,null,null,{"$f":"IF($L$7=\"Si\",SUM(D112:G112),SUM(E112:G112))","v":0},null,{"$f":"H112+I112","v":0}]
[null,null,{"$f":"C81","v":""},null,null,null,null,{"$f":"IF($L$7=\"Si\",SUM(D113:G113),SUM(E113:G113))","v":0},null,{"$f":"H113+I113","v":0}]
[null,null,{"$f":"C82","v":""},null,null,null,null,{"$f":"IF($L$7=\"Si\",SUM(D114:G114),SUM(E114:G114))","v":0},null,{"$f":"H114+I114","v":0}]
[null,null,{"$f":"C83","v":""},null,null,null,null,{"$f":"IF($L$7=\"Si\",SUM(D115:G115),SUM(E115:G115))","v":0},null,{"$f":"H115+I115","v":0}]
[null,null,null,null,null,null,null,0,null,0]
[null,null,null,null,null,null,null,0,null,0]
[null,null,null,null,null,null,null,0,null,0]
[null,null,null,null,null,null,null,0,null,0]
[null,null,null,null,null,null,null,0,null,0]
[null,null,null,null,null,null,null,0,null,0]
[null,null,null,null,null,null,null,0,null,0]
[null,null,null,null,null,null,null,0,null,0]
[null,null,null,null,null,null,null,0,null,0]
[null,null,null,null,null,null,null,0,null,0]
[null,null,null,null,null,null,null,0,null,0]
[null,null,null,null,null,null,null,0,null,0]
[null,null,null,null,null,null,null,0,null,0]
[null,null,null,null,null,null,null,0,null,0]
[null,null,null,null,null,null,null,0,null,0]
[null,null,null,null,null,null,null,0,null,0]
[null,null,null,null,null,null,null,0,null,0]
[null,null,null,null,null,null,null,0,null,0]
[null,null,null,null,null,null,null,0,null,0]
[null,null,null,null,null,null,null,0,null,0]
[null,null,null,null,null,null,null,0,null,0]
[null,null,null,null,null,null,null,0,null,0]
[null,null,null,null,null,null,null,0,null,0]
[null,null,null,null,null,null,null,{"$f":"IF($L$7=\"Si\",SUM(D139:G139),SUM(E139:G139))","v":0},null,{"$f":"H139+I139","v":0}]
[null,null,null,null,null,null,null,{"$f":"IF($L$7=\"Si\",SUM(D140:G140),SUM(E140:G140))","v":0},null,{"$f":"H140+I140","v":0}]
[null,1001,"TOTALE SERVIZI DI CONSULENZA",null,{"$f":"SUM(E111:E140)","v":0},0,0,0,0,0]
[null,null,"COSTI TOTALI DISTINTI PER IMPRESA"]
[null,null,{"$f":"C111","v":0},null,{"$f":"E15+E47+E79+E111","v":0},0,0,0,0,0]
[null,null,{"$f":"C112","v":""},null,0,0,0,0,0,0]
[null,null,{"$f":"C113","v":""},null,0,0,0,0,0,0]
[null,null,{"$f":"C114","v":""},null,{"$f":"E18+E50+E82+E114","v":0},0,0,0,0,0]
[null,null,{"$f":"C115","v":""},null,{"$f":"E19+E51+E83+E115","v":0},0,0,0,0,0]
[null,null,null,null,{"$f":"E20+E52+E84+E116","v":0},0,0,0,0,0]
[null,null,null,null,{"$f":"E21+E53+E85+E117","v":0},0,0,0,0,0]
[null,null,null,null,{"$f":"E22+E54+E86+E118","v":0},0,0,0,0,0]
[null,null,null,null,{"$f":"E23+E55+E87+E119","v":0},0,0,0,0,0]
[null,null,null,null,{"$f":"E24+E56+E88+E120","v":0},0,0,0,0,0]
[null,null,null,null,{"$f":"E25+E57+E89+E121","v":0},0,0,0,0,0]
[null,null,null,null,{"$f":"E26+E58+E90+E122","v":0},0,0,0,0,0]
[null,null,null,null,{"$f":"E27+E59+E91+E123","v":0},0,0,0,0,0]
[null,null,null,null,{"$f":"E28+E60+E92+E124","v":0},0,0,0,0,0]
[null,null,null,null,{"$f":"E29+E61+E93+E125","v":0},0,0,0,0,0]
[null,null,null,null,{"$f":"E30+E62+E94+E126","v":0},0,0,0,0,0]
[null,null,null,null,{"$f":"E31+E63+E95+E127","v":0},0,0,0,0,0]
[null,null,null,null,{"$f":"E32+E64+E96+E128","v":0},0,0,0,0,0]
[null,null,null,null,{"$f":"E33+E65+E97+E129","v":0},0,0,0,0,0]
[null,null,null,null,{"$f":"E34+E66+E98+E130","v":0},0,0,0,0,0]
[null,null,null,null,{"$f":"E35+E67+E99+E131","v":0},0,0,0,0,0]
[null,null,null,null,{"$f":"E36+E68+E100+E132","v":0},0,0,0,0,0]
[null,null,null,null,{"$f":"E37+E69+E101+E133","v":0},0,0,0,0,0]
[null,null,null,null,{"$f":"E38+E70+E102+E134","v":0},0,0,0,0,0]
[null,null,null,null,{"$f":"E39+E71+E103+E135","v":0},0,0,0,0,0]
[null,null,null,null,{"$f":"E40+E72+E104+E136","v":0},0,0,0,0,0]
[null,null,null,null,{"$f":"E41+E73+E105+E137","v":0},0,0,0,0,0]
[null,null,null,null,{"$f":"E42+E74+E106+E138","v":0},0,0,0,0,0]
[null,null,null,null,{"$f":"E43+E75+E107+E139","v":0},0,0,0,0,0]
[null,null,null,null,{"$f":"E44+E76+E108+E140","v":0},0,0,0,0,0]
[null,null,"TOTALE GENERALE",null,0,0,0,0,0,0]
[]
[]
[null,null,"B) PREVISIONE DEI COSTI DELLE ATTIVITA' PER I PROGRAMMI PRESENTATI IN FORMA ASSOCIATA (Per tipo di attività)"]
[]
[null,null," TIPO DI COSTO",null,{"$f":"E$13","v":2014},{"$f":"E178+1","v":2015},{"$f":"F178+1","v":2016},{"$f":"\"TOTALE\n\"&IF($L$7=\"Si\",\" AL \",E178&\"-\") &G178","v":"TOTALE\n2014-2016"},"SUCCESSIVI \nA FINIRE","TOTALE\nGENER."]
[null,null,"COSTI PER ATTIVITA' DI FATTIBILITA' TECNICA"]
[null,null,{"$f":"C143","v":0},null,{"$f":"ALL_C!E27","v":0},{"$f":"ALL_C!F27","v":0},{"$f":"ALL_C!Q27","v":0},{"$f":"ALL_C!R27","v":0},{"$f":"ALL_C!S27","v":0},{"$f":"ALL_C!T27","v":0}]
[null,null,{"$f":"C144","v":""},null,null,null,null,{"$f":"IF($L$7=\"Si\",SUM(D181:G181),SUM(E181:G181))","v":0},null,{"$f":"H181+I181","v":0}]
[null,null,{"$f":"C145","v":""},null,null,null,null,{"$f":"IF($L$7=\"Si\",SUM(D182:G182),SUM(E182:G182))","v":0},null,{"$f":"H182+I182","v":0}]
[null,null,{"$f":"C146","v":""},null,null,null,null,{"$f":"IF($L$7=\"Si\",SUM(D183:G183),SUM(E183:G183))","v":0},null,{"$f":"H183+I183","v":0}]
[null,null,{"$f":"C147","v":""},null,null,null,null,{"$f":"IF($L$7=\"Si\",SUM(D184:G184),SUM(E184:G184))","v":0},null,{"$f":"H184+I184","v":0}]
[null,null,null,null,null,null,null,0,null,0]
[null,null,null,null,null,null,null,0,null,0]
[null,null,null,null,null,null,null,0,null,0]
[null,null,null,null,null,null,null,0,null,0]
[null,null,null,null,null,null,null,0,null,0]
[null,null,null,null,null,null,null,0,null,0]
[null,null,null,null,null,null,null,0,null,0]
[null,null,null,null,null,null,null,0,null,0]
[null,null,null,null,null,null,null,0,null,0]
[null,null,null,null,null,null,null,0,null,0]
[null,null,null,null,null,null,null,0,null,0]
[null,null,null,null,null,null,null,0,null,0]
[null,null,null,null,null,null,null,0,null,0]
[null,null,null,null,null,null,null,0,null,0]
[null,null,null,null,null,null,null,0,null,0]
[null,null,null,null,null,null,null,0,null,0]
[null,null,null,null,null,null,null,0,null,0]
[null,null,null,null,null,null,null,0,null,0]
[null,null,null,null,null,null,null,0,null,0]
[null,null,null,null,null,null,null,0,null,0]
[null,null,null,null,null,null,null,0,null,0]
[null,null,null,null,null,null,null,0,null,0]
[null,null,null,null,null,null,null,0,null,0]
[null,null,null,null,null,null,null,{"$f":"IF($L$7=\"Si\",SUM(D208:G208),SUM(E208:G208))","v":0},null,{"$f":"H208+I208","v":0}]
[null,null,null,null,null,null,null,{"$f":"IF($L$7=\"Si\",SUM(D209:G209),SUM(E209:G209))","v":0},null,{"$f":"H209+I209","v":0}]
[null,1001,"TOTALE STUDI DI FATTIBILITA' TECNICA",null,{"$f":"SUM(E180:E209)","v":0},0,0,0,0,0]
[null,null,"COSTI PER RICERCA INDUSTRIALE"]
[null,null,{"$f":"C180","v":0},null,{"$f":"ALL_C!E28","v":0},{"$f":"ALL_C!F28","v":0},{"$f":"ALL_C!Q28","v":0},{"$f":"ALL_C!R28","v":0},{"$f":"ALL_C!S28","v":0},{"$f":"ALL_C!T28","v":0}]
[null,null,{"$f":"C181","v":""},null,null,null,null,{"$f":"IF($L$7=\"Si\",SUM(D213:G213),SUM(E213:G213))","v":0},null,{"$f":"H213+I213","v":0}]
[null,null,{"$f":"C182","v":""},null,null,null,null,{"$f":"IF($L$7=\"Si\",SUM(D214:G214),SUM(E214:G214))","v":0},null,{"$f":"H214+I214","v":0}]
[null,null,{"$f":"C183","v":""},null,null,null,null,{"$f":"IF($L$7=\"Si\",SUM(D215:G215),SUM(E215:G215))","v":0},null,{"$f":"H215+I215","v":0}]
[null,null,{"$f":"C184","v":""},null,null,null,null,{"$f":"IF($L$7=\"Si\",SUM(D216:G216),SUM(E216:G216))","v":0},null,{"$f":"H216+I216","v":0}]
[null,null,null,null,null,null,null,0,null,0]
[null,null,null,null,null,null,null,0,null,0]
[null,null,null,null,null,null,null,0,null,0]
[null,null,null,null,null,null,null,0,null,0]
[null,null,null,null,null,null,null,0,null,0]
[null,null,null,null,null,null,null,0,null,0]
[null,null,null,null,null,null,null,0,null,0]
[null,null,null,null,null,null,null,0,null,0]
[null,null,null,null,null,null,null,0,null,0]
[null,null,null,null,null,null,null,0,null,0]
[null,null,null,null,null,null,null,0,null,0]
[null,null,null,null,null,null,null,0,null,0]
[null,null,null,null,null,null,null,0,null,0]
[null,null,null,null,null,null,null,0,null,0]
[null,null,null,null,null,null,null,0,null,0]
[null,null,null,null,null,null,null,0,null,0]
[null,null,null,null,null,null,null,0,null,0]
[null,null,null,null,null,null,null,0,null,0]
[null,null,null,null,null,null,null,0,null,0]
[null,null,null,null,null,null,null,0,null,0]
[null,null,null,null,null,null,null,0,null,0]
[null,null,null,null,null,null,null,0,null,0]
[null,null,null,null,null,null,null,0,null,0]
[null,null,null,null,null,null,null,{"$f":"IF($L$7=\"Si\",SUM(D240:G240),SUM(E240:G240))","v":0},null,{"$f":"H240+I240","v":0}]
[null,null,null,null,null,null,null,{"$f":"IF($L$7=\"Si\",SUM(D241:G241),SUM(E241:G241))","v":0},null,{"$f":"H241+I241","v":0}]
[null,1001,"TOTALE RICERCA INDUSTRIALE ",null,{"$f":"SUM(E212:E241)","v":0},0,0,0,0,0]
[null,null,"COSTI PER SVLUPPO SPERIMENTALE"]
[null,null,{"$f":"C212","v":0},null,{"$f":"ALL_C!E29","v":0},{"$f":"ALL_C!F29","v":0},{"$f":"ALL_C!Q29","v":0},{"$f":"ALL_C!R29","v":0},{"$f":"ALL_C!S29","v":0},{"$f":"ALL_C!T29","v":0}]
[null,null,{"$f":"C213","v":""},null,null,null,null,{"$f":"IF($L$7=\"Si\",SUM(D245:G245),SUM(E245:G245))","v":0},null,{"$f":"H245+I245","v":0}]
[null,null,{"$f":"C214","v":""},null,null,null,null,{"$f":"IF($L$7=\"Si\",SUM(D246:G246),SUM(E246:G246))","v":0},null,{"$f":"H246+I246","v":0}]
[null,null,{"$f":"C215","v":""},null,null,null,null,{"$f":"IF($L$7=\"Si\",SUM(D247:G247),SUM(E247:G247))","v":0},null,{"$f":"H247+I247","v":0}]
[null,null,{"$f":"C216","v":""},null,null,null,null,{"$f":"IF($L$7=\"Si\",SUM(D248:G248),SUM(E248:G248))","v":0},null,{"$f":"H248+I248","v":0}]
[null,null,null,null,null,null,null,0,null,0]
[null,null,null,null,null,null,null,0,null,0]
[null,null,null,null,null,null,null,0,null,0]
[null,null,null,null,null,null,null,0,null,0]
[null,null,null,null,null,null,null,0,null,0]
[null,null,null,null,null,null,null,0,null,0]
[null,null,null,null,null,null,null,0,null,0]
[null,null,null,null,null,null,null,0,null,0]
[null,null,null,null,null,null,null,0,null,0]
[null,null,null,null,null,null,null,0,null,0]
[null,null,null,null,null,null,null,0,null,0]
[null,null,null,null,null,null,null,0,null,0]
[null,null,null,null,null,null,null,0,null,0]
[null,null,null,null,null,null,null,0,null,0]
[null,null,null,null,null,null,null,0,null,0]
[null,null,null,null,null,null,null,0,null,0]
[null,null,null,null,null,null,null,0,null,0]
[null,null,null,null,null,null,null,0,null,0]
[null,null,null,null,null,null,null,0,null,0]
[null,null,null,null,null,null,null,0,null,0]
[null,null,null,null,null,null,null,0,null,0]
[null,null,null,null,null,null,null,0,null,0]
[null,null,null,null,null,null,null,0,null,0]
[null,null,null,null,null,null,null,{"$f":"IF($L$7=\"Si\",SUM(D272:G272),SUM(E272:G272))","v":0},null,{"$f":"H272+I272","v":0}]
[null,null,null,null,null,null,null,{"$f":"IF($L$7=\"Si\",SUM(D273:G273),SUM(E273:G273))","v":0},null,{"$f":"H273+I273","v":0}]
[null,1001,"TOTALE SVILUPPO SPERIMENTALE  (1)",null,{"$f":"SUM(E244:E273)","v":0},0,0,0,0,0]
[null,null,"COSTI TOTALI DISTINTI PER IMPRESA"]
[null,null,{"$f":"C244","v":0},null,{"$f":"E180+E212+E244","v":0},0,0,0,0,0]
[null,null,{"$f":"C245","v":""},null,{"$f":"E181+E213+E245","v":0},0,0,0,0,0]
[null,null,{"$f":"C246","v":""},null,{"$f":"E182+E214+E246","v":0},0,0,0,0,0]
[null,null,{"$f":"C247","v":""},null,{"$f":"E183+E215+E247","v":0},0,0,0,0,0]
[null,null,{"$f":"C248","v":""},null,{"$f":"E184+E216+E248","v":0},0,0,0,0,0]
[null,null,null,null,{"$f":"E185+E217+E249","v":0},0,0,0,0,0]
[null,null,null,null,{"$f":"E186+E218+E250","v":0},0,0,0,0,0]
[null,null,null,null,{"$f":"E187+E219+E251","v":0},0,0,0,0,0]
[null,null,null,null,{"$f":"E188+E220+E252","v":0},0,0,0,0,0]
[null,null,null,null,{"$f":"E189+E221+E253","v":0},0,0,0,0,0]
[null,null,null,null,{"$f":"E190+E222+E254","v":0},0,0,0,0,0]
[null,null,null,null,{"$f":"E191+E223+E255","v":0},0,0,0,0,0]
[null,null,null,null,{"$f":"E192+E224+E256","v":0},0,0,0,0,0]
[null,null,null,null,{"$f":"E193+E225+E257","v":0},0,0,0,0,0]
[null,null,null,null,{"$f":"E194+E226+E258","v":0},0,0,0,0,0]
[null,null,null,null,{"$f":"E195+E227+E259","v":0},0,0,0,0,0]
[null,null,null,null,{"$f":"E196+E228+E260","v":0},0,0,0,0,0]
[null,null,null,null,{"$f":"E197+E229+E261","v":0},0,0,0,0,0]
[null,null,null,null,{"$f":"E198+E230+E262","v":0},0,0,0,0,0]
[null,null,null,null,{"$f":"E199+E231+E263","v":0},0,0,0,0,0]
[null,null,null,null,{"$f":"E200+E232+E264","v":0},0,0,0,0,0]
[null,null,null,null,{"$f":"E201+E233+E265","v":0},0,0,0,0,0]
[null,null,null,null,{"$f":"E202+E234+E266","v":0},0,0,0,0,0]
[null,null,null,null,{"$f":"E203+E235+E267","v":0},0,0,0,0,0]
[null,null,null,null,{"$f":"E204+E236+E268","v":0},0,0,0,0,0]
[null,null,null,null,{"$f":"E205+E237+E269","v":0},0,0,0,0,0]
[null,null,null,null,{"$f":"E206+E238+E270","v":0},0,0,0,0,0]
[null,null,null,null,{"$f":"E207+E239+E271","v":0},0,0,0,0,0]
[null,null,null,null,{"$f":"E208+E240+E272","v":0},0,0,0,0,0]
[null,null,null,null,{"$f":"E209+E241+E273","v":0},0,0,0,0,0]
[null,null,"TOTALE GENERALE",null,{"$f":"E210+E242+E274","v":0},0,0,0,0,0]
[null,null,"(1) INCLUSA LA SPERIMENTAZIONE PROTOTIPI E PRE-SERIE"]
[]
[]
[null,null,null,null,null,null,null,null,null,null,null,null,{"$f":"CONCATENATE(M162,M163,M164,M165,M166,M167,M168,M169,M170,M171,M172,M173)","v":""}]
[null,null,null,null,null,null,null,null,null,null,null,null,{"$f":"CONCATENATE(M277,M278,M279,M280,M282,M281,M283,M284,M285,M286,M287,M288,M289,M290,M291)","v":""},{"$f":"CONCATENATE(N277,N278,N279,N280,N282,N281,N283,N284,N285,N286,N287,N288,N289,N290,N291)","v":""}]
[null,null,null,null,null,null,null,null,null,null,null,null,{"$f":"CONCATENATE(M292,M293,M294,M295,M296,M297,M298,M299,M300,M301,M302,M303,M304,M305,M306)","v":""},{"$f":"CONCATENATE(N292,N293,N294,N295,N296,N297,N298,N299,N300,N301,N302,N303,N304,N305,N306)","v":""}]
[null,null,null,null,null,null,null,null,null,null,null,null,{"$f":"CONCATENATE(M312,M311,M310,M308)","v":""},{"$f":"CONCATENATE(N312,N311,N310,N308)","v":""}]

{"sheet":"ALL_D","index":9,"n_rows":17,"n_cols":38,"rows_kept":17,"cut":false,"hidden":true,"merged":[[0,37,4,37],[0,36,4,36],[0,34,4,34],[0,35,4,35],[8,1,8,32],[6,2,6,3],[6,4,6,7],[0,2,0,10],[1,2,1,10],[3,2,3,10],[0,1,3,1],[4,2,4,10]]}
[null,"Ministero dello\nSviluppo economico",null,null,null,null,null,null,null,null,null,null,null,null,null,null,null,null,null,null,null,null,null,null,null,null,null,null,null,null,null,null,null,null,"check compilazione","check coerenza","fin.to L. 808/85","ANNO_FINE"]
[null,null,{"$f":"MENU!B5","v":"Direzione generale per la politica industriale, la competitività e le PMI"}]
[]
[null,null,{"$f":"MENU!B7","v":"Divisione IX “Industrie aerospazio,  difesa e sicurezza”"}]
[null,"Torna al menu principale","DOMANDA DI ACCESSO AI PROGETTI DI RICERCA E SVILUPPO EX. L. 808/85\n- ALLEGATO D: RISULTATI COMMERCIALI DEL PROGETTO - Previsione vendite tecnologie/prodotti sviluppati con il progetto"]
[]
[null,null,"Legge 808/85 – PROGETTO:",null,{"$f":"IF(ALL_A!$F$7=0,\"\",ALL_A!$F$7)","v":""},null,null,null,"Area:",{"$f":"ALL_A!I7","v":"Civile"},null,null,null,null,null,null,null,null,null,null,null,null,null,null,null,null,null,null,null,null,null,null,null,null,null,null,{"$f":"ALL_A!$E$9","v":"No"},{"$f":"ALL_A!$G$16","v":0}]
[]
[null,"RISULTATI COMMERCIALI DEL PROGETTO - Previsione vendite tecnologie/prodotti sviluppati con il progetto"]
[]
[null,"ANNO",{"$f":"ALL_A!G16","v":0},{"$f":"C11+1","v":1},{"$f":"D11+1","v":2},3,4,5,6,7,8,9,10,11,12,13,14,15,16,17,18,19,20,{"$f":"W11+1","v":21},22,23,24,25,26,27,28,29,{"$f":"\"TOTALE\n\"&C11&\"-\"&AF11","v":"TOTALE\n0-29"}]
[null,"CONSEGNE/ANNO",null,null,null,null,null,null,null,null,null,null,null,null,null,null,null,null,null,null,null,null,null,null,null,null,null,null,null,null,null,null,{"$f":"SUM(C12:AF12)","v":0}]
[null,"CONSEGNE CUMULATE",{"$f":"C12","v":0},{"$f":"C13+D12","v":0},{"$f":"D13+E12","v":0},0,0,0,0,0,0,0,0,0,0,0,0,0,0,0,0,0,0,0,0,0,0,0,0,0,0,0,{"$f":"AF13","v":0}]
[null,"PREZZO UNITARIO (Euro)"]
[null,"INCASSI (migliaia di euro)",{"$f":"C12*C14/1000","v":0},{"$f":"D12*D14/1000","v":0},0,0,0,0,0,0,0,0,0,0,0,0,0,0,0,0,0,0,0,0,0,0,0,0,0,0,0,0,{"$f":"SUM(C15:AF15)","v":0},null,{"$f":"IF(AG15=0,\"Nessuna pianificazione vendite\",\"\")","v":"Nessuna pianificazione vendite"}]
[null,"* La tabella va compilata almeno per i primi 7 anni dall’avvio della commercializzazione"]
[null,null,null,null,null,null,null,null,null,null,null,null,null,null,null,null,null,null,null,null,null,null,null,null,null,null,null,null,null,null,null,null,null,null,{"$f":"CONCATENATE(AI15)","v":"Nessuna pianificazione vendite"}]

{"sheet":"EXP_PROGRAMMA","index":10,"n_rows":4,"n_cols":39,"rows_kept":4,"cut":false,"hidden":true,"merged":[]}
["ID","CODICE_PROGRAMMA","PROGRAMMA","ID_TIPOLOGIA_PROGRAMMA","FLAG_GIA_FINANZIATO","ID_PROGRAMMA_PRECEDENTE","FLAG_IMPRESE_ASSOCIATE","FLAG_CAPOFILA","ULTIMO_ESERCIZIO_CHIUSO","ID_SOGGETTO","RAGIONE_SOCIALE","SEDE_LEGALE","DIMENSIONE_IMPRESA","ISCRIZIONE_CCIAA","ISCRIZIONE_INPS","CAPITALE_SOCIALE","ATTIVITA","STABILIMENTI_PRODUZIONE","DATA_PRES_DOMANDA","PROTOCOLLO_MISE","FLAG_AMMESSO","FLAG_MOLTO_INNOVATIVO","PERC_MAGGIOR_PERSONALE","ANNO_COMPLET_TO_ROGRAMMA","DURATA_RESTITUZIONE"]
[1,1,{"$f":"IF(ALL_A!F7=\"\",\"\",ALL_A!F7)","v":""},{"$f":"IF(ALL_A!I7=\"\",\"\",IF(ALL_A!I7=\"Civile\",1,2))","v":1},{"$f":"IF(ALL_A!E9=\"Si\",1,0)","v":0},null,{"$f":"IF(ALL_A!G9=\"Imprese associate\",1,0)","v":0},{"$f":"IF(ALL_A!I9=\"Si\",1,0)","v":0},{"$f":"ALL_A!F11","v":0},null,{"$f":"IF(ALL_A!F39=\"\",\"\",ALL_A!F39)","v":""},{"$f":"IF(ALL_A!F40=\"\",\"\",ALL_A!F40)","v":""},{"$f":"IF(ALL_A!F13=\"\",\"\",ALL_A!F13)","v":""},{"$f":"IF(ALL_A!F42=\"\",\"\",ALL_A!F42)","v":""},{"$f":"IF(ALL_A!F43=\"\",\"\",ALL_A!F43)","v":""},{"$f":"ALL_A!F44","v":0},{"$f":"IF(ALL_A!F206=\"\",\"\",ALL_A!F206)","v":""},{"$f":"IF(ALL_A!F207=\"\",\"\",ALL_A!F207)","v":""},null,null,null,null,null,{"$f":"IF(ALL_A!G16=\"\",\"\",ALL_A!G16)","v":""},{"$f":"IF(ALL_A!I11=\"\",\"\",ALL_A!I11)","v":""},null,null,null,null,null,null,null,null,null,null,null,null,null,{"$f":"SUM(A4:X4)","v":3}]
[]
[{"$f":"IFERROR(A2,\"#ERR\")","v":1},{"$f":"IFERROR(B2,\"#ERR\")","v":1},"",1,0,0,0,0,0,0,"","","","","",0,"","",0,0,0,0,0,"","",null,{"$f":"COUNTIF(B4:Y4,\"#ERR\")","v":0}]

{"sheet":"EXP_SOGGETTI_BIL_VOCI","index":11,"n_rows":71,"n_cols":27,"rows_kept":71,"cut":false,"hidden":true,"merged":[]}
["ID","ANNO","ID_SCHEMI_BIL_VOCE","CODICE_VOCE","DESCRIZIONE_VOCE","IMPORTO",null,null,null,"SP","ANNO","OFFSET"]
[1,{"$f":"EXP_SOGGETTI_BIL!$C$2","v":""},101,"SPA.A","CREDITI VERSO SOCI PER VERSAMENTI ANCORA DOVUTI",{"$f":"VLOOKUP(C2,ALL_A.1!$A$14:$E$24,VLOOKUP(B2,$K$1:$L$3,2,0),0)","v":0},null,null,null,null,{"$f":"EXP_SOGGETTI_BIL!$C$2","v":""},4,null,null,null,null,null,null,null,null,null,null,null,null,null,{"$f":"IFERROR(SUM(F2:F71),\"#ERR\")","v":0},{"$f":"COUNTIF(Z:Z,\"#ERR\")","v":0}]
[1,{"$f":"EXP_SOGGETTI_BIL!$C$2","v":""},105,"SPA.B","IMMOBILIZZAZIONI",{"$f":"VLOOKUP(C3,ALL_A.1!$A$14:$E$24,VLOOKUP(B3,$K$1:$L$3,2,0),0)","v":0},null,null,null,null,{"$f":"EXP_SOGGETTI_BIL!$C$3","v":""},5]
[1,{"$f":"EXP_SOGGETTI_BIL!$C$2","v":""},111,"SPA.C.I","Rimanenze",{"$f":"VLOOKUP(C4,ALL_A.1!$A$14:$E$24,VLOOKUP(B4,$K$1:$L$3,2,0),0)","v":0}]
[1,{"$f":"EXP_SOGGETTI_BIL!$C$2","v":""},112,"SPA.C.II.1","verso Clienti",{"$f":"VLOOKUP(C5,ALL_A.1!$A$14:$E$24,VLOOKUP(B5,$K$1:$L$3,2,0),0)","v":0},null,null,null,"CE","ANNO","OFFSET"]
[1,{"$f":"EXP_SOGGETTI_BIL!$C$2","v":""},113,"SPA.C.II.1OLTRE","di cui oltre l'esercizio successivo",{"$f":"VLOOKUP(C6,ALL_A.1!$A$14:$E$24,VLOOKUP(B6,$K$1:$L$3,2,0),0)","v":0},null,null,null,null,{"$f":"EXP_SOGGETTI_BIL!$C$2","v":""},6]
[1,{"$f":"EXP_SOGGETTI_BIL!$C$2","v":""},114,"SPA.C.II.2-3-4-5","verso altri (esclusi quelli vs. clienti)",{"$f":"VLOOKUP(C7,ALL_A.1!$A$14:$E$24,VLOOKUP(B7,$K$1:$L$3,2,0),0)","v":0},null,null,null,null,{"$f":"EXP_SOGGETTI_BIL!$C$3","v":""},8]
[1,{"$f":"EXP_SOGGETTI_BIL!$C$2","v":""},115,"SPA.C.II.2-3-4-5OLTRE","di cui oltre l'esercizio successivo",{"$f":"VLOOKUP(C8,ALL_A.1!$A$14:$E$24,VLOOKUP(B8,$K$1:$L$3,2,0),0)","v":0}]
[1,{"$f":"EXP_SOGGETTI_BIL!$C$2","v":""},131,"SPP.A","Patrimonio netto",{"$f":"VLOOKUP(C9,ALL_A.1!$F$14:$J$30,VLOOKUP(B9,$K$1:$L$3,2,0),0)","v":0},null,null,null,{"$f":"$J$1&\"A\"","v":"SPA"},"ALL_A.1!$A$14:$E$24",5]
[1,{"$f":"EXP_SOGGETTI_BIL!$C$2","v":""},132,"SPP.B","FONDI RISCHI E ONERI",{"$f":"VLOOKUP(C10,ALL_A.1!$F$14:$J$30,VLOOKUP(B10,$K$1:$L$3,2,0),0)","v":0},null,null,null,{"$f":"$J$1&\"P\"","v":"SPP"},"ALL_A.1!$F$14:$J$30",5]
[1,{"$f":"EXP_SOGGETTI_BIL!$C$2","v":""},133,"SPP.C","TRATTAMENTO DI FINE RAPPORTO",{"$f":"VLOOKUP(C11,ALL_A.1!$F$14:$J$30,VLOOKUP(B11,$K$1:$L$3,2,0),0)","v":0},null,null,null,{"$f":"J5","v":"CE"},"ALL_A.2!$A$16:$H$39",8]
[1,{"$f":"EXP_SOGGETTI_BIL!$C$2","v":""},134,"SPP.D.1-2","Obbligazioni e obbligazioni convertibili",{"$f":"VLOOKUP(C12,ALL_A.1!$F$14:$J$30,VLOOKUP(B12,$K$1:$L$3,2,0),0)","v":0}]
[1,{"$f":"EXP_SOGGETTI_BIL!$C$2","v":""},135,"SPP.D.1-2OLTRE","di cui oltre l'esercizio successivo",{"$f":"VLOOKUP(C13,ALL_A.1!$F$14:$J$30,VLOOKUP(B13,$K$1:$L$3,2,0),0)","v":0}]
[1,{"$f":"EXP_SOGGETTI_BIL!$C$2","v":""},136,"SPP.D.4","Debiti verso banche",{"$f":"VLOOKUP(C14,ALL_A.1!$F$14:$J$30,VLOOKUP(B14,$K$1:$L$3,2,0),0)","v":0}]
[1,{"$f":"EXP_SOGGETTI_BIL!$C$2","v":""},137,"SPP.D.4OLTRE","di cui oltre l'esercizio successivo",{"$f":"VLOOKUP(C15,ALL_A.1!$F$14:$J$30,VLOOKUP(B15,$K$1:$L$3,2,0),0)","v":0}]
[1,{"$f":"EXP_SOGGETTI_BIL!$C$2","v":""},138,"SPP.D.5","Debiti verso altri finanziatori",{"$f":"VLOOKUP(C16,ALL_A.1!$F$14:$J$30,VLOOKUP(B16,$K$1:$L$3,2,0),0)","v":0}]
[1,{"$f":"EXP_SOGGETTI_BIL!$C$2","v":""},139,"SPP.D.5OLTRE","di cui oltre l'esercizio successivo",{"$f":"VLOOKUP(C17,ALL_A.1!$F$14:$J$30,VLOOKUP(B17,$K$1:$L$3,2,0),0)","v":0}]
[1,{"$f":"EXP_SOGGETTI_BIL!$C$2","v":""},142,"SPP.D.7","Debiti verso fornitori",{"$f":"VLOOKUP(C18,ALL_A.1!$F$14:$J$30,VLOOKUP(B18,$K$1:$L$3,2,0),0)","v":0}]
[1,{"$f":"EXP_SOGGETTI_BIL!$C$2","v":""},143,"SPP.D.12-13","Debiti tributari e verso istituti di previdenza e sicurezza sociale",{"$f":"VLOOKUP(C19,ALL_A.1!$F$14:$J$30,VLOOKUP(B19,$K$1:$L$3,2,0),0)","v":0}]
[1,{"$f":"EXP_SOGGETTI_BIL!$C$2","v":""},144,"SPP.D.ALTRI","Altri debiti",{"$f":"VLOOKUP(C20,ALL_A.1!$F$14:$J$30,VLOOKUP(B20,$K$1:$L$3,2,0),0)","v":0}]
[1,{"$f":"EXP_SOGGETTI_BIL!$C$2","v":""},145,"SPP.D.ALTRIOLTRE","di cui oltre l'esercizio successivo",{"$f":"VLOOKUP(C21,ALL_A.1!$F$14:$J$30,VLOOKUP(B21,$K$1:$L$3,2,0),0)","v":0}]
[1,{"$f":"EXP_SOGGETTI_BIL!$C$2","v":""},149,"CE.A.1","Ricavi delle vendite e delle prestazioni",{"$f":"VLOOKUP(C22,ALL_A.2!$A$16:$H$39,VLOOKUP(B22,$K$6:$L$7,2,0),0)","v":0}]
[1,{"$f":"EXP_SOGGETTI_BIL!$C$2","v":""},153,"CE.A.5","Altri ricavi e proventi",{"$f":"VLOOKUP(C23,ALL_A.2!$A$16:$H$39,VLOOKUP(B23,$K$6:$L$7,2,0),0)","v":0}]
[1,{"$f":"EXP_SOGGETTI_BIL!$C$2","v":""},154,"CE.A","Valore della produzione",{"$f":"VLOOKUP(C24,ALL_A.2!$A$16:$H$39,VLOOKUP(B24,$K$6:$L$7,2,0),0)","v":0}]
[1,{"$f":"EXP_SOGGETTI_BIL!$C$2","v":""},155,"CE.B.6","per Materie prime, di consumo e di merci",{"$f":"VLOOKUP(C25,ALL_A.2!$A$16:$H$39,VLOOKUP(B25,$K$6:$L$7,2,0),0)","v":0}]
[1,{"$f":"EXP_SOGGETTI_BIL!$C$2","v":""},156,"CE.B.7","per Servizi",{"$f":"VLOOKUP(C26,ALL_A.2!$A$16:$H$39,VLOOKUP(B26,$K$6:$L$7,2,0),0)","v":0}]
[1,{"$f":"EXP_SOGGETTI_BIL!$C$2","v":""},180,"CE.B.7.1","di cui Utenze",{"$f":"VLOOKUP(C27,ALL_A.2!$A$16:$H$39,VLOOKUP(B27,$K$6:$L$7,2,0),0)","v":0}]
[1,{"$f":"EXP_SOGGETTI_BIL!$C$2","v":""},181,"CE.B.7.\n2","di cui Manutenzioni",{"$f":"VLOOKUP(C28,ALL_A.2!$A$16:$H$39,VLOOKUP(B28,$K$6:$L$7,2,0),0)","v":0}]
[1,{"$f":"EXP_SOGGETTI_BIL!$C$2","v":""},157,"CE.B.8","per Godimento beni di terzi",{"$f":"VLOOKUP(C29,ALL_A.2!$A$16:$H$39,VLOOKUP(B29,$K$6:$L$7,2,0),0)","v":0}]
[1,{"$f":"EXP_SOGGETTI_BIL!$C$2","v":""},158,"CE.B.9","per il Personale",{"$f":"VLOOKUP(C30,ALL_A.2!$A$16:$H$39,VLOOKUP(B30,$K$6:$L$7,2,0),0)","v":0}]
[1,{"$f":"EXP_SOGGETTI_BIL!$C$2","v":""},159,"CE.B.10","Ammortamenti e svalutazioni",{"$f":"VLOOKUP(C31,ALL_A.2!$A$16:$H$39,VLOOKUP(B31,$K$6:$L$7,2,0),0)","v":0}]
[1,{"$f":"EXP_SOGGETTI_BIL!$C$2","v":""},160,"CE.B.11","Variaz. rimanenze di materie, sussidiarie, di consumo e di merci",{"$f":"VLOOKUP(C32,ALL_A.2!$A$16:$H$39,VLOOKUP(B32,$K$6:$L$7,2,0),0)","v":0}]
[1,{"$f":"EXP_SOGGETTI_BIL!$C$2","v":""},170,"CE.C","Totale Proventi (+) e Oneri (-) Finanziari",{"$f":"VLOOKUP(C33,ALL_A.2!$A$16:$H$39,VLOOKUP(B33,$K$6:$L$7,2,0),0)","v":0}]
[1,{"$f":"EXP_SOGGETTI_BIL!$C$2","v":""},176,"CE.E","Totale Proventi (+) e Oneri (-) Straordinari",{"$f":"VLOOKUP(C34,ALL_A.2!$A$16:$H$39,VLOOKUP(B34,$K$6:$L$7,2,0),0)","v":0}]
[1,{"$f":"EXP_SOGGETTI_BIL!$C$2","v":""},178,"CE.22","Imposte sul reddito dell'esercizio",{"$f":"VLOOKUP(C35,ALL_A.2!$A$16:$H$39,VLOOKUP(B35,$K$6:$L$7,2,0),0)","v":0}]
[1,{"$f":"EXP_SOGGETTI_BIL!$C$2","v":""},179,"CE.UTILE","UTILE / PERDITA D'ESERCIZIO",{"$f":"VLOOKUP(C36,ALL_A.2!$A$16:$H$39,VLOOKUP(B36,$K$6:$L$7,2,0),0)","v":0}]
[1,{"$f":"EXP_SOGGETTI_BIL!$C$3","v":""},101,"SPA.A","CREDITI VERSO SOCI PER VERSAMENTI ANCORA DOVUTI",{"$f":"VLOOKUP(C37,ALL_A.1!$A$14:$E$24,VLOOKUP(B37,$K$1:$L$3,2,0),0)","v":0}]
[1,{"$f":"EXP_SOGGETTI_BIL!$C$3","v":""},105,"SPA.B","IMMOBILIZZAZIONI",{"$f":"VLOOKUP(C38,ALL_A.1!$A$14:$E$24,VLOOKUP(B38,$K$1:$L$3,2,0),0)","v":0}]
[1,{"$f":"EXP_SOGGETTI_BIL!$C$3","v":""},111,"SPA.C.I","Rimanenze",{"$f":"VLOOKUP(C39,ALL_A.1!$A$14:$E$24,VLOOKUP(B39,$K$1:$L$3,2,0),0)","v":0}]
[1,{"$f":"EXP_SOGGETTI_BIL!$C$3","v":""},112,"SPA.C.II.1","verso Clienti",{"$f":"VLOOKUP(C40,ALL_A.1!$A$14:$E$24,VLOOKUP(B40,$K$1:$L$3,2,0),0)","v":0}]
[1,{"$f":"EXP_SOGGETTI_BIL!$C$3","v":""},113,"SPA.C.II.1OLTRE","di cui oltre l'esercizio successivo",{"$f":"VLOOKUP(C41,ALL_A.1!$A$14:$E$24,VLOOKUP(B41,$K$1:$L$3,2,0),0)","v":0}]
[1,{"$f":"EXP_SOGGETTI_BIL!$C$3","v":""},114,"SPA.C.II.2-3-4-5","verso altri (esclusi quelli vs. clienti)",{"$f":"VLOOKUP(C42,ALL_A.1!$A$14:$E$24,VLOOKUP(B42,$K$1:$L$3,2,0),0)","v":0}]
[1,{"$f":"EXP_SOGGETTI_BIL!$C$3","v":""},115,"SPA.C.II.2-3-4-5OLTRE","di cui oltre l'esercizio successivo",{"$f":"VLOOKUP(C43,ALL_A.1!$A$14:$E$24,VLOOKUP(B43,$K$1:$L$3,2,0),0)","v":0}]
[1,{"$f":"EXP_SOGGETTI_BIL!$C$3","v":""},131,"SPP.A","Patrimonio netto",{"$f":"VLOOKUP(C44,ALL_A.1!$F$14:$J$30,VLOOKUP(B44,$K$1:$L$3,2,0),0)","v":0}]
[1,{"$f":"EXP_SOGGETTI_BIL!$C$3","v":""},132,"SPP.B","FONDI RISCHI E ONERI",{"$f":"VLOOKUP(C45,ALL_A.1!$F$14:$J$30,VLOOKUP(B45,$K$1:$L$3,2,0),0)","v":0}]
[1,{"$f":"EXP_SOGGETTI_BIL!$C$3","v":""},133,"SPP.C","TRATTAMENTO DI FINE RAPPORTO",{"$f":"VLOOKUP(C46,ALL_A.1!$F$14:$J$30,VLOOKUP(B46,$K$1:$L$3,2,0),0)","v":0}]
[1,{"$f":"EXP_SOGGETTI_BIL!$C$3","v":""},134,"SPP.D.1-2","Obbligazioni e obbligazioni convertibili",{"$f":"VLOOKUP(C47,ALL_A.1!$F$14:$J$30,VLOOKUP(B47,$K$1:$L$3,2,0),0)","v":0}]
[1,{"$f":"EXP_SOGGETTI_BIL!$C$3","v":""},135,"SPP.D.1-2OLTRE","di cui oltre l'esercizio successivo",{"$f":"VLOOKUP(C48,ALL_A.1!$F$14:$J$30,VLOOKUP(B48,$K$1:$L$3,2,0),0)","v":0}]
[1,{"$f":"EXP_SOGGETTI_BIL!$C$3","v":""},136,"SPP.D.4","Debiti verso banche",{"$f":"VLOOKUP(C49,ALL_A.1!$F$14:$J$30,VLOOKUP(B49,$K$1:$L$3,2,0),0)","v":0}]
[1,{"$f":"EXP_SOGGETTI_BIL!$C$3","v":""},137,"SPP.D.4OLTRE","di cui oltre l'esercizio successivo",{"$f":"VLOOKUP(C50,ALL_A.1!$F$14:$J$30,VLOOKUP(B50,$K$1:$L$3,2,0),0)","v":0}]
[1,{"$f":"EXP_SOGGETTI_BIL!$C$3","v":""},138,"SPP.D.5","Debiti verso altri finanziatori",{"$f":"VLOOKUP(C51,ALL_A.1!$F$14:$J$30,VLOOKUP(B51,$K$1:$L$3,2,0),0)","v":0}]
[1,{"$f":"EXP_SOGGETTI_BIL!$C$3","v":""},139,"SPP.D.5OLTRE","di cui oltre l'esercizio successivo",{"$f":"VLOOKUP(C52,ALL_A.1!$F$14:$J$30,VLOOKUP(B52,$K$1:$L$3,2,0),0)","v":0}]
[1,{"$f":"EXP_SOGGETTI_BIL!$C$3","v":""},142,"SPP.D.7","Debiti verso fornitori",{"$f":"VLOOKUP(C53,ALL_A.1!$F$14:$J$30,VLOOKUP(B53,$K$1:$L$3,2,0),0)","v":0}]
[1,{"$f":"EXP_SOGGETTI_BIL!$C$3","v":""},143,"SPP.D.12-13","Debiti tributari e verso istituti di previdenza e sicurezza sociale",{"$f":"VLOOKUP(C54,ALL_A.1!$F$14:$J$30,VLOOKUP(B54,$K$1:$L$3,2,0),0)","v":0}]
[1,{"$f":"EXP_SOGGETTI_BIL!$C$3","v":""},144,"SPP.D.ALTRI","Altri debiti",{"$f":"VLOOKUP(C55,ALL_A.1!$F$14:$J$30,VLOOKUP(B55,$K$1:$L$3,2,0),0)","v":0}]
[1,{"$f":"EXP_SOGGETTI_BIL!$C$3","v":""},145,"SPP.D.ALTRIOLTRE","di cui oltre l'esercizio successivo",{"$f":"VLOOKUP(C56,ALL_A.1!$F$14:$J$30,VLOOKUP(B56,$K$1:$L$3,2,0),0)","v":0}]
[1,{"$f":"EXP_SOGGETTI_BIL!$C$3","v":""},149,"CE.A.1","Ricavi delle vendite e delle prestazioni",{"$f":"VLOOKUP(C57,ALL_A.2!$A$16:$H$39,VLOOKUP(B57,EXP_SOGGETTI_BIL_VOCI!$K$6:$L$7,2,0),0)","v":0}]
[1,{"$f":"EXP_SOGGETTI_BIL!$C$3","v":""},153,"CE.A.5","Altri ricavi e proventi",{"$f":"VLOOKUP(C58,ALL_A.2!$A$16:$H$39,VLOOKUP(B58,EXP_SOGGETTI_BIL_VOCI!$K$6:$L$7,2,0),0)","v":0}]
[1,{"$f":"EXP_SOGGETTI_BIL!$C$3","v":""},154,"CE.A","Valore della produzione",{"$f":"VLOOKUP(C59,ALL_A.2!$A$16:$H$39,VLOOKUP(B59,EXP_SOGGETTI_BIL_VOCI!$K$6:$L$7,2,0),0)","v":0}]
[1,{"$f":"EXP_SOGGETTI_BIL!$C$3","v":""},155,"CE.B.6","per Materie prime, di consumo e di merci",{"$f":"VLOOKUP(C60,ALL_A.2!$A$16:$H$39,VLOOKUP(B60,EXP_SOGGETTI_BIL_VOCI!$K$6:$L$7,2,0),0)","v":0}]
[1,{"$f":"EXP_SOGGETTI_BIL!$C$3","v":""},156,"CE.B.7","per Servizi",{"$f":"VLOOKUP(C61,ALL_A.2!$A$16:$H$39,VLOOKUP(B61,EXP_SOGGETTI_BIL_VOCI!$K$6:$L$7,2,0),0)","v":0}]
[1,{"$f":"EXP_SOGGETTI_BIL!$C$3","v":""},180,"CE.B.7.1","di cui Utenze",{"$f":"VLOOKUP(C62,ALL_A.2!$A$16:$H$39,VLOOKUP(B62,EXP_SOGGETTI_BIL_VOCI!$K$6:$L$7,2,0),0)","v":0}]
[1,{"$f":"EXP_SOGGETTI_BIL!$C$3","v":""},181,"CE.B.7.\n2","di cui Manutenzioni",{"$f":"VLOOKUP(C63,ALL_A.2!$A$16:$H$39,VLOOKUP(B63,EXP_SOGGETTI_BIL_VOCI!$K$6:$L$7,2,0),0)","v":0}]
[1,{"$f":"EXP_SOGGETTI_BIL!$C$3","v":""},157,"CE.B.8","per Godimento beni di terzi",{"$f":"VLOOKUP(C64,ALL_A.2!$A$16:$H$39,VLOOKUP(B64,EXP_SOGGETTI_BIL_VOCI!$K$6:$L$7,2,0),0)","v":0}]
[1,{"$f":"EXP_SOGGETTI_BIL!$C$3","v":""},158,"CE.B.9","per il Personale",{"$f":"VLOOKUP(C65,ALL_A.2!$A$16:$H$39,VLOOKUP(B65,EXP_SOGGETTI_BIL_VOCI!$K$6:$L$7,2,0),0)","v":0}]
[1,{"$f":"EXP_SOGGETTI_BIL!$C$3","v":""},159,"CE.B.10","Ammortamenti e svalutazioni",{"$f":"VLOOKUP(C66,ALL_A.2!$A$16:$H$39,VLOOKUP(B66,EXP_SOGGETTI_BIL_VOCI!$K$6:$L$7,2,0),0)","v":0}]
[1,{"$f":"EXP_SOGGETTI_BIL!$C$3","v":""},160,"CE.B.11","Variaz. rimanenze di materie, sussidiarie, di consumo e di merci",{"$f":"VLOOKUP(C67,ALL_A.2!$A$16:$H$39,VLOOKUP(B67,EXP_SOGGETTI_BIL_VOCI!$K$6:$L$7,2,0),0)","v":0}]
[1,{"$f":"EXP_SOGGETTI_BIL!$C$3","v":""},170,"CE.C","Totale Proventi (+) e Oneri (-) Finanziari",{"$f":"VLOOKUP(C68,ALL_A.2!$A$16:$H$39,VLOOKUP(B68,EXP_SOGGETTI_BIL_VOCI!$K$6:$L$7,2,0),0)","v":0}]
[1,{"$f":"EXP_SOGGETTI_BIL!$C$3","v":""},176,"CE.E","Totale Proventi (+) e Oneri (-) Straordinari",{"$f":"VLOOKUP(C69,ALL_A.2!$A$16:$H$39,VLOOKUP(B69,EXP_SOGGETTI_BIL_VOCI!$K$6:$L$7,2,0),0)","v":0}]
[1,{"$f":"EXP_SOGGETTI_BIL!$C$3","v":""},178,"CE.22","Imposte sul reddito dell'esercizio",{"$f":"VLOOKUP(C70,ALL_A.2!$A$16:$H$39,VLOOKUP(B70,EXP_SOGGETTI_BIL_VOCI!$K$6:$L$7,2,0),0)","v":0}]
[1,{"$f":"EXP_SOGGETTI_BIL!$C$3","v":""},179,"CE.UTILE","UTILE / PERDITA D'ESERCIZIO",{"$f":"VLOOKUP(C71,ALL_A.2!$A$16:$H$39,VLOOKUP(B71,EXP_SOGGETTI_BIL_VOCI!$K$6:$L$7,2,0),0)","v":0}]

{"sheet":"EXP_STATO_DOMANDA","index":12,"n_rows":18,"n_cols":9,"rows_kept":18,"cut":false,"hidden":true,"merged":[]}
["ID","ID_PROGRAMMA","MODULO","STATO_COMPILAZIONE","DETTAGLI","CHECK"]
[1,null,{"$f":"MENU!C20","v":"Allegato A: Dati generali sul Progetto e sull'impresa richiedente"},{"$f":"MENU!H20","v":"Compilazione da completare"},{"$f":"IF(ALL_A!L402=\"\",\"\",\"DATI INCOERENTI:\n\"&ALL_A!L402)&\nIF(ALL_A!K402=\"\",\"\",\"DATI DA COMPLETARE:\n\"&ALL_A!K402)","v":"DATI DA COMPLETARE:\nLegge 808/85 – Progetto\n(max. 80 caratteri):  - Il progetto è presentato da: \n - ULTIMO ESERCIZIO CONTABILE CHIUSO \n - DURATA DEL PIANO DELLE  RESTITUZIONI (Art. 8 Comma 2 del bando) \n - DIMENSIONE DELL'IMPRESA \n - DURATA PROGETTO \n - DENOMINAZIONE \n - SEDE LEGALE \n - ISCRIZIONE CCIAA \n - ISCRIZIONE INPS \n - CAPITALE SOCIALE (euro) \n - SOCI  E RELATIVE QUOTE (%) \n - ATTIVITÀ (principali attività produttive dell’azienda) \n - STABILIMENTI DI PRODUZIONE  (ubicazione e principali linee di produzione) \n - PERSONALE (N° ADDETTI al 31 dicembre) \n - di cui RICERCATORI/TECNICI \n"},{"$f":"IF(MENU!H20<>\"Ok\",1,0)","v":1},null,"EXP_PROGRAMMA",{"$f":"SUM(EXP_PROGRAMMA!AA:AA)","v":0}]
[1,null,{"$f":"MENU!D21","v":"ALLEGATO A.1: ELEMENTI PATRIMONIALI"},{"$f":"MENU!H21","v":"Compilazione da completare"},{"$f":"IF(ALL_A.1!M50=\"\",\"\",\"DATI INCOERENTI:\n\"&ALL_A.1!M50)&\nIF(ALL_A.1!L46=\"\",\"\",\"DATI DA COMPLETARE:\n\"&ALL_A.1!L46)","v":"DATI DA COMPLETARE:\n-Elementi Patrimoniali da compilare"},{"$f":"IF(MENU!H21<>\"Ok\",1,0)","v":1},null,"EXP_SOGGETTI_BIL_VOCI",{"$f":"SUM(EXP_SOGGETTI_BIL_VOCI!AA:AA)","v":0}]
[1,null,{"$f":"MENU!D22","v":"ALLEGATO A.2: ELEMENTI DEL CONTO ECONOMICO"},{"$f":"MENU!H22","v":"Compilazione da completare"},{"$f":"IF(ALL_A.2!L56=\"\",\"\",\"DATI INCOERENTI:\n\"&ALL_A.2!L56)&\nIF(ALL_A.2!K56=\"\",\"\",\"DATI DA COMPLETARE:\n\"&ALL_A.2!K56)","v":"DATI DA COMPLETARE:\n - Elementi del Conto Economico da compilare \n"},{"$f":"IF(MENU!H22<>\"Ok\",1,0)","v":1},null,"EXP_SOCI",{"$f":"SUM(EXP_SOCI!AA:AA)","v":0}]
[1,null,{"$f":"MENU!C23","v":"Allegato C: Previsioni di costo del Progetto"},{"$f":"MENU!H23","v":"Compilazione da completare"},{"$f":"IF(ALL_C!X581=\"\",\"\",\"DATI INCOERENTI:\n\"&ALL_C!X581)&\nIF(ALL_C!W581=\"\",\"\",\"DATI DA COMPLETARE:\n\"&ALL_C!W581)","v":"DATI DA COMPLETARE:\n - C-2) PREVISIONE DEI COSTI DELLE ATTIVITA' (Per tipi di attivita')  \n - 1) COSTO ORARIO MEDIO RICERCATORI /TECNICI \n - 1) COSTO ORARIO MEDIO OPERAI ED ALTRI \n - 2)  DETTAGLIO PERSONALE DIPENDENTE: ORE / ANNO IMPIEGATE SUL PROGETTO \n - Numero ore di lavoro complessivamente svolte da tutto il personale aziendale   (B) \n - 5.1) COSTI INDIRETTI: PERSONALE INDIRETTO (Importi in migliaia di euro) \n - 5.3) COSTI INDIRETTI: SPESE GENERALI E DI FUNZIONAMENTO (Importi in migliaia di euro) \n"},{"$f":"IF(MENU!H23<>\"Ok\",1,0)","v":1},null,"EXP_ADDETTI_ANNO_CONTRATTO",{"$f":"SUM(EXP_ADDETTI_ANNO_CONTRATTO!AA:AA)","v":0}]
[1,null,{"$f":"MENU!C24","v":"Allegato D: Previsioni delle vendite del Programma"},{"$f":"MENU!H24","v":"Compilazione da completare"},{"$f":"IF(ALL_D!AJ17=\"\",\"\",\"DATI INCOERENTI:\n\"&ALL_D!AJ17)&\nIF(ALL_D!AI17=\"\",\"\",\"DATI DA COMPLETARE:\n\"&ALL_D!AI17)","v":"DATI DA COMPLETARE:\nNessuna pianificazione vendite"},{"$f":"IF(MENU!H24<>\"Ok\",1,0)","v":1},null,"EXP_ADDETTI_ANNO_ISTRUZIONE",{"$f":"SUM(EXP_ADDETTI_ANNO_ISTRUZIONE!AA:AA)","v":0}]
[null,null,null,null,null,null,null,"EXP_PARTECIPAZIONI",{"$f":"SUM(EXP_PARTECIPAZIONI!AA:AA)","v":0}]
[null,null,null,null,null,null,null,"EXP_PREVISIONI_SINTESI",{"$f":"SUM(EXP_PREVISIONI_SINTESI!AA:AA)","v":0}]
[null,null,null,null,null,null,null,"EXP_SOGGETTI_BIL",{"$f":"SUM(EXP_SOGGETTI_BIL!AA:AA)","v":0}]
[null,null,null,null,null,null,null,"EXP_PREVISIONI_COSTI_DETTAGLIO",{"$f":"SUM(EXP_PREVISIONI_COSTI_DETTAGLIO!AA:AA)","v":0}]
[null,null,null,null,null,null,null,"EXP_PREVISIONI_PERSONALE_STD",{"$f":"SUM(EXP_PREVISIONI_PERSONALE_STD!AA:AA)","v":0}]
[null,null,null,null,null,null,null,"EXP_PREVISIONI_PERSONALE_ANNO",{"$f":"SUM(EXP_PREVISIONI_PERSONALE_ANNO!AA:AA)","v":0}]
[null,null,null,null,null,null,null,"EXP_PREVIS_PERS_NON_DIP_ANNO",{"$f":"SUM(EXP_PREVIS_PERS_NON_DIP_ANNO!AA:AA)","v":0}]
[null,null,null,null,null,null,null,"EXP_PREVIS_PERS_TOT_ORE_ANNO",{"$f":"SUM(EXP_PREVIS_PERS_TOT_ORE_ANNO!AA:AA)","v":0}]
[null,null,null,null,null,null,null,"EXP_PREVIS_PERS_IND_ANNO",{"$f":"SUM(EXP_PREVIS_PERS_IND_ANNO!AA:AA)","v":0}]
[null,null,null,null,null,null,null,"EXP_PREVIS_PERS_IND_AMM_ANNO",{"$f":"SUM(EXP_PREVIS_PERS_IND_AMM_ANNO!AA:AA)","v":0}]
[null,null,null,null,null,null,null,"EXP_PREVIS_PERS_IND_SPEGEN_ANNO",{"$f":"SUM(EXP_PREVIS_PERS_IND_SPEGEN_ANNO!AA:AA)","v":0}]
[null,null,null,null,null,null,null,"EXP_PREVISIONI_VENDITE",{"$f":"SUM(EXP_PREVISIONI_VENDITE!AA:AA)","v":0}]

{"sheet":"EXP_IMPRESE_ASSOCIATE","index":13,"n_rows":31,"n_cols":27,"rows_kept":31,"cut":false,"hidden":true,"merged":[]}
["ID","DENOMINAZIONE","ID_PROGRAMMA","ID_SOGGETTO","COSTO PER IMPRESA","DIMENSIONE_ASSOCIATA"]
[1,{"$f":"IF(ALL_A!C47=\"\",\"\",ALL_A!C47)","v":0},null,null,{"$f":"IF(ALL_A!H47=\"\",\"\",ALL_A!H47)","v":0},{"$f":"IF(ALL_A!G47=\"\",\"\",ALL_A!G47)","v":0},null,null,null,null,null,null,null,null,null,null,null,null,null,null,null,null,null,{"$f":"IFERROR(F2,\"#ERR\")","v":0},{"$f":"IFERROR(B2,\"#ERR\")","v":0},{"$f":"IFERROR(E2,\"#ERR\")","v":0},{"$f":"COUNTIF(X:Z,\"#ERR\")","v":0}]
[1,{"$f":"IF(ALL_A!C48=\"\",\"\",ALL_A!C48)","v":""},null,null,{"$f":"IF(ALL_A!H48=\"\",\"\",ALL_A!H48)","v":""},{"$f":"IF(ALL_A!G48=\"\",\"\",ALL_A!G48)","v":""},null,null,null,null,null,null,null,null,null,null,null,null,null,null,null,null,null,{"$f":"IFERROR(F3,\"#ERR\")","v":""},{"$f":"IFERROR(B3,\"#ERR\")","v":""},{"$f":"IFERROR(E3,\"#ERR\")","v":""}]
[1,{"$f":"IF(ALL_A!C49=\"\",\"\",ALL_A!C49)","v":""},null,null,{"$f":"IF(ALL_A!H49=\"\",\"\",ALL_A!H49)","v":""},{"$f":"IF(ALL_A!G49=\"\",\"\",ALL_A!G49)","v":""},null,null,null,null,null,null,null,null,null,null,null,null,null,null,null,null,null,"","",""]
[1,{"$f":"IF(ALL_A!C50=\"\",\"\",ALL_A!C50)","v":""},null,null,{"$f":"IF(ALL_A!H50=\"\",\"\",ALL_A!H50)","v":""},{"$f":"IF(ALL_A!G50=\"\",\"\",ALL_A!G50)","v":""},null,null,null,null,null,null,null,null,null,null,null,null,null,null,null,null,null,"","",""]
[1,{"$f":"IF(ALL_A!C51=\"\",\"\",ALL_A!C51)","v":""},null,null,{"$f":"IF(ALL_A!H51=\"\",\"\",ALL_A!H51)","v":""},{"$f":"IF(ALL_A!G51=\"\",\"\",ALL_A!G51)","v":""},null,null,null,null,null,null,null,null,null,null,null,null,null,null,null,null,null,"","",""]
[1,null,null,null,null,{"$f":"IF(ALL_A!G52=\"\",\"\",ALL_A!G52)","v":""},null,null,null,null,null,null,null,null,null,null,null,null,null,null,null,null,null,"",0,0]
[1,null,null,null,null,{"$f":"IF(ALL_A!G53=\"\",\"\",ALL_A!G53)","v":""},null,null,null,null,null,null,null,null,null,null,null,null,null,null,null,null,null,"",0,0]
[1,null,null,null,null,{"$f":"IF(ALL_A!G54=\"\",\"\",ALL_A!G54)","v":""},null,null,null,null,null,null,null,null,null,null,null,null,null,null,null,null,null,"",0,0]
[1,null,null,null,null,{"$f":"IF(ALL_A!G55=\"\",\"\",ALL_A!G55)","v":""},null,null,null,null,null,null,null,null,null,null,null,null,null,null,null,null,null,"",0,0]
[1,null,null,null,null,{"$f":"IF(ALL_A!G56=\"\",\"\",ALL_A!G56)","v":""},null,null,null,null,null,null,null,null,null,null,null,null,null,null,null,null,null,"",0,0]
[1,null,null,null,null,{"$f":"IF(ALL_A!G57=\"\",\"\",ALL_A!G57)","v":""},null,null,null,null,null,null,null,null,null,null,null,null,null,null,null,null,null,"",0,0]
[1,null,null,null,null,{"$f":"IF(ALL_A!G58=\"\",\"\",ALL_A!G58)","v":""},null,null,null,null,null,null,null,null,null,null,null,null,null,null,null,null,null,"",0,0]
[1,null,null,null,null,{"$f":"IF(ALL_A!G59=\"\",\"\",ALL_A!G59)","v":""},null,null,null,null,null,null,null,null,null,null,null,null,null,null,null,null,null,"",0,0]
[1,null,null,null,null,{"$f":"IF(ALL_A!G60=\"\",\"\",ALL_A!G60)","v":""},null,null,null,null,null,null,null,null,null,null,null,null,null,null,null,null,null,"",0,0]
[1,null,null,null,null,{"$f":"IF(ALL_A!G61=\"\",\"\",ALL_A!G61)","v":""},null,null,null,null,null,null,null,null,null,null,null,null,null,null,null,null,null,"",0,0]
[1,null,null,null,null,{"$f":"IF(ALL_A!G62=\"\",\"\",ALL_A!G62)","v":""},null,null,null,null,null,null,null,null,null,null,null,null,null,null,null,null,null,"",0,0]
[1,null,null,null,null,{"$f":"IF(ALL_A!G63=\"\",\"\",ALL_A!G63)","v":""},null,null,null,null,null,null,null,null,null,null,null,null,null,null,null,null,null,"",0,0]
[1,null,null,null,null,{"$f":"IF(ALL_A!G64=\"\",\"\",ALL_A!G64)","v":""},null,null,null,null,null,null,null,null,null,null,null,null,null,null,null,null,null,"",0,0]
[1,null,null,null,null,{"$f":"IF(ALL_A!G65=\"\",\"\",ALL_A!G65)","v":""},null,null,null,null,null,null,null,null,null,null,null,null,null,null,null,null,null,"",0,0]
[1,null,null,null,null,{"$f":"IF(ALL_A!G66=\"\",\"\",ALL_A!G66)","v":""},null,null,null,null,null,null,null,null,null,null,null,null,null,null,null,null,null,"",0,0]
[1,null,null,null,null,{"$f":"IF(ALL_A!G67=\"\",\"\",ALL_A!G67)","v":""},null,null,null,null,null,null,null,null,null,null,null,null,null,null,null,null,null,"",0,0]
[1,null,null,null,null,{"$f":"IF(ALL_A!G68=\"\",\"\",ALL_A!G68)","v":""},null,null,null,null,null,null,null,null,null,null,null,null,null,null,null,null,null,"",0,0]
[1,null,null,null,null,{"$f":"IF(ALL_A!G69=\"\",\"\",ALL_A!G69)","v":""},null,null,null,null,null,null,null,null,null,null,null,null,null,null,null,null,null,"",0,0]
[1,null,null,null,null,{"$f":"IF(ALL_A!G70=\"\",\"\",ALL_A!G70)","v":""},null,null,null,null,null,null,null,null,null,null,null,null,null,null,null,null,null,"",0,0]
[1,null,null,null,null,{"$f":"IF(ALL_A!G71=\"\",\"\",ALL_A!G71)","v":""},null,null,null,null,null,null,null,null,null,null,null,null,null,null,null,null,null,"",0,0]
[1,null,null,null,null,{"$f":"IF(ALL_A!G72=\"\",\"\",ALL_A!G72)","v":""},null,null,null,null,null,null,null,null,null,null,null,null,null,null,null,null,null,"",0,0]
[1,null,null,null,null,{"$f":"IF(ALL_A!G73=\"\",\"\",ALL_A!G73)","v":""},null,null,null,null,null,null,null,null,null,null,null,null,null,null,null,null,null,"",0,0]
[1,null,null,null,null,{"$f":"IF(ALL_A!G74=\"\",\"\",ALL_A!G74)","v":""},null,null,null,null,null,null,null,null,null,null,null,null,null,null,null,null,null,"",0,0]
[1,null,null,null,null,{"$f":"IF(ALL_A!G75=\"\",\"\",ALL_A!G75)","v":""},null,null,null,null,null,null,null,null,null,null,null,null,null,null,null,null,null,"",0,0]
[1,null,null,null,null,{"$f":"IF(ALL_A!G76=\"\",\"\",ALL_A!G76)","v":""},null,null,null,null,null,null,null,null,null,null,null,null,null,null,null,null,null,"",0,0]

{"sheet":"EXP_SOCI","index":14,"n_rows":146,"n_cols":27,"rows_kept":146,"cut":false,"hidden":true,"merged":[]}
["ID","ID_PROGRAMMA","SOCIO","QUOTA_PERC"]
[1,null,{"$f":"IF(ALL_A!C57=\"\",\"\",ALL_A!C57)","v":""},{"$f":"IF(ALL_A!H57=\"\",\"\",ALL_A!H57)","v":""},null,null,null,null,null,null,null,null,null,null,null,null,null,null,null,null,null,null,null,null,{"$f":"IFERROR(C2,\"#ERR\")","v":""},{"$f":"IFERROR(SUM(D2:D146),\"#ERR\")","v":0},{"$f":"COUNTIF(X:Z,\"#ERR\")","v":0}]
[1,null,{"$f":"IF(ALL_A!C58=\"\",\"\",ALL_A!C58)","v":""},{"$f":"IF(ALL_A!H58=\"\",\"\",ALL_A!H58)","v":""},null,null,null,null,null,null,null,null,null,null,null,null,null,null,null,null,null,null,null,null,{"$f":"IFERROR(C3,\"#ERR\")","v":""}]
[1,null,{"$f":"IF(ALL_A!C59=\"\",\"\",ALL_A!C59)","v":""},{"$f":"IF(ALL_A!H59=\"\",\"\",ALL_A!H59)","v":""},null,null,null,null,null,null,null,null,null,null,null,null,null,null,null,null,null,null,null,null,""]
[1,null,{"$f":"IF(ALL_A!C60=\"\",\"\",ALL_A!C60)","v":""},{"$f":"IF(ALL_A!H60=\"\",\"\",ALL_A!H60)","v":""},null,null,null,null,null,null,null,null,null,null,null,null,null,null,null,null,null,null,null,null,""]
[1,null,{"$f":"IF(ALL_A!C61=\"\",\"\",ALL_A!C61)","v":""},{"$f":"IF(ALL_A!H61=\"\",\"\",ALL_A!H61)","v":""},null,null,null,null,null,null,null,null,null,null,null,null,null,null,null,null,null,null,null,null,""]
[1,null,{"$f":"IF(ALL_A!C62=\"\",\"\",ALL_A!C62)","v":""},{"$f":"IF(ALL_A!H62=\"\",\"\",ALL_A!H62)","v":""},null,null,null,null,null,null,null,null,null,null,null,null,null,null,null,null,null,null,null,null,""]
[1,null,{"$f":"IF(ALL_A!C63=\"\",\"\",ALL_A!C63)","v":""},{"$f":"IF(ALL_A!H63=\"\",\"\",ALL_A!H63)","v":""},null,null,null,null,null,null,null,null,null,null,null,null,null,null,null,null,null,null,null,null,""]
[1,null,{"$f":"IF(ALL_A!C64=\"\",\"\",ALL_A!C64)","v":""},{"$f":"IF(ALL_A!H64=\"\",\"\",ALL_A!H64)","v":""},null,null,null,null,null,null,null,null,null,null,null,null,null,null,null,null,null,null,null,null,""]
[1,null,{"$f":"IF(ALL_A!C65=\"\",\"\",ALL_A!C65)","v":""},{"$f":"IF(ALL_A!H65=\"\",\"\",ALL_A!H65)","v":""},null,null,null,null,null,null,null,null,null,null,null,null,null,null,null,null,null,null,null,null,""]
[1,null,{"$f":"IF(ALL_A!C66=\"\",\"\",ALL_A!C66)","v":""},{"$f":"IF(ALL_A!H66=\"\",\"\",ALL_A!H66)","v":""},null,null,null,null,null,null,null,null,null,null,null,null,null,null,null,null,null,null,null,null,""]
[1,null,{"$f":"IF(ALL_A!C67=\"\",\"\",ALL_A!C67)","v":""},{"$f":"IF(ALL_A!H67=\"\",\"\",ALL_A!H67)","v":""},null,null,null,null,null,null,null,null,null,null,null,null,null,null,null,null,null,null,null,null,""]
[1,null,{"$f":"IF(ALL_A!C68=\"\",\"\",ALL_A!C68)","v":""},{"$f":"IF(ALL_A!H68=\"\",\"\",ALL_A!H68)","v":""},null,null,null,null,null,null,null,null,null,null,null,null,null,null,null,null,null,null,null,null,""]
[1,null,{"$f":"IF(ALL_A!C69=\"\",\"\",ALL_A!C69)","v":""},{"$f":"IF(ALL_A!H69=\"\",\"\",ALL_A!H69)","v":""},null,null,null,null,null,null,null,null,null,null,null,null,null,null,null,null,null,null,null,null,""]
[1,null,{"$f":"IF(ALL_A!C70=\"\",\"\",ALL_A!C70)","v":""},{"$f":"IF(ALL_A!H70=\"\",\"\",ALL_A!H70)","v":""},null,null,null,null,null,null,null,null,null,null,null,null,null,null,null,null,null,null,null,null,""]
[1,null,{"$f":"IF(ALL_A!C71=\"\",\"\",ALL_A!C71)","v":""},{"$f":"IF(ALL_A!H71=\"\",\"\",ALL_A!H71)","v":""},null,null,null,null,null,null,null,null,null,null,null,null,null,null,null,null,null,null,null,null,""]
[1,null,{"$f":"IF(ALL_A!C72=\"\",\"\",ALL_A!C72)","v":""},{"$f":"IF(ALL_A!H72=\"\",\"\",ALL_A!H72)","v":""},null,null,null,null,null,null,null,null,null,null,null,null,null,null,null,null,null,null,null,null,""]
[1,null,{"$f":"IF(ALL_A!C73=\"\",\"\",ALL_A!C73)","v":""},{"$f":"IF(ALL_A!H73=\"\",\"\",ALL_A!H73)","v":""},null,null,null,null,null,null,null,null,null,null,null,null,null,null,null,null,null,null,null,null,""]
[1,null,{"$f":"IF(ALL_A!C74=\"\",\"\",ALL_A!C74)","v":""},{"$f":"IF(ALL_A!H74=\"\",\"\",ALL_A!H74)","v":""},null,null,null,null,null,null,null,null,null,null,null,null,null,null,null,null,null,null,null,null,""]
[1,null,{"$f":"IF(ALL_A!C75=\"\",\"\",ALL_A!C75)","v":""},{"$f":"IF(ALL_A!H75=\"\",\"\",ALL_A!H75)","v":""},null,null,null,null,null,null,null,null,null,null,null,null,null,null,null,null,null,null,null,null,""]
[1,null,{"$f":"IF(ALL_A!C76=\"\",\"\",ALL_A!C76)","v":""},{"$f":"IF(ALL_A!H76=\"\",\"\",ALL_A!H76)","v":""},null,null,null,null,null,null,null,null,null,null,null,null,null,null,null,null,null,null,null,null,""]
[1,null,{"$f":"IF(ALL_A!C77=\"\",\"\",ALL_A!C77)","v":""},{"$f":"IF(ALL_A!H77=\"\",\"\",ALL_A!H77)","v":""},null,null,null,null,null,null,null,null,null,null,null,null,null,null,null,null,null,null,null,null,""]
[1,null,{"$f":"IF(ALL_A!C78=\"\",\"\",ALL_A!C78)","v":""},{"$f":"IF(ALL_A!H78=\"\",\"\",ALL_A!H78)","v":""},null,null,null,null,null,null,null,null,null,null,null,null,null,null,null,null,null,null,null,null,""]
[1,null,{"$f":"IF(ALL_A!C79=\"\",\"\",ALL_A!C79)","v":""},{"$f":"IF(ALL_A!H79=\"\",\"\",ALL_A!H79)","v":""},null,null,null,null,null,null,null,null,null,null,null,null,null,null,null,null,null,null,null,null,""]
[1,null,{"$f":"IF(ALL_A!C80=\"\",\"\",ALL_A!C80)","v":""},{"$f":"IF(ALL_A!H80=\"\",\"\",ALL_A!H80)","v":""},null,null,null,null,null,null,null,null,null,null,null,null,null,null,null,null,null,null,null,null,""]
[1,null,{"$f":"IF(ALL_A!C81=\"\",\"\",ALL_A!C81)","v":""},{"$f":"IF(ALL_A!H81=\"\",\"\",ALL_A!H81)","v":""},null,null,null,null,null,null,null,null,null,null,null,null,null,null,null,null,null,null,null,null,""]
[1,null,{"$f":"IF(ALL_A!C82=\"\",\"\",ALL_A!C82)","v":""},{"$f":"IF(ALL_A!H82=\"\",\"\",ALL_A!H82)","v":""},null,null,null,null,null,null,null,null,null,null,null,null,null,null,null,null,null,null,null,null,""]
[1,null,{"$f":"IF(ALL_A!C83=\"\",\"\",ALL_A!C83)","v":""},{"$f":"IF(ALL_A!H83=\"\",\"\",ALL_A!H83)","v":""},null,null,null,null,null,null,null,null,null,null,null,null,null,null,null,null,null,null,null,null,""]
[1,null,{"$f":"IF(ALL_A!C84=\"\",\"\",ALL_A!C84)","v":""},{"$f":"IF(ALL_A!H84=\"\",\"\",ALL_A!H84)","v":""},null,null,null,null,null,null,null,null,null,null,null,null,null,null,null,null,null,null,null,null,""]
[1,null,{"$f":"IF(ALL_A!C85=\"\",\"\",ALL_A!C85)","v":""},{"$f":"IF(ALL_A!H85=\"\",\"\",ALL_A!H85)","v":""},null,null,null,null,null,null,null,null,null,null,null,null,null,null,null,null,null,null,null,null,""]
[1,null,{"$f":"IF(ALL_A!C86=\"\",\"\",ALL_A!C86)","v":""},{"$f":"IF(ALL_A!H86=\"\",\"\",ALL_A!H86)","v":""},null,null,null,null,null,null,null,null,null,null,null,null,null,null,null,null,null,null,null,null,""]
[1,null,{"$f":"IF(ALL_A!C87=\"\",\"\",ALL_A!C87)","v":""},{"$f":"IF(ALL_A!H87=\"\",\"\",ALL_A!H87)","v":""},null,null,null,null,null,null,null,null,null,null,null,null,null,null,null,null,null,null,null,null,""]
[1,null,{"$f":"IF(ALL_A!C88=\"\",\"\",ALL_A!C88)","v":""},{"$f":"IF(ALL_A!H88=\"\",\"\",ALL_A!H88)","v":""},null,null,null,null,null,null,null,null,null,null,null,null,null,null,null,null,null,null,null,null,""]
[1,null,{"$f":"IF(ALL_A!C89=\"\",\"\",ALL_A!C89)","v":""},{"$f":"IF(ALL_A!H89=\"\",\"\",ALL_A!H89)","v":""},null,null,null,null,null,null,null,null,null,null,null,null,null,null,null,null,null,null,null,null,""]
[1,null,{"$f":"IF(ALL_A!C90=\"\",\"\",ALL_A!C90)","v":""},{"$f":"IF(ALL_A!H90=\"\",\"\",ALL_A!H90)","v":""},null,null,null,null,null,null,null,null,null,null,null,null,null,null,null,null,null,null,null,null,""]
[1,null,{"$f":"IF(ALL_A!C91=\"\",\"\",ALL_A!C91)","v":""},{"$f":"IF(ALL_A!H91=\"\",\"\",ALL_A!H91)","v":""},null,null,null,null,null,null,null,null,null,null,null,null,null,null,null,null,null,null,null,null,""]
[1,null,{"$f":"IF(ALL_A!C92=\"\",\"\",ALL_A!C92)","v":""},{"$f":"IF(ALL_A!H92=\"\",\"\",ALL_A!H92)","v":""},null,null,null,null,null,null,null,null,null,null,null,null,null,null,null,null,null,null,null,null,""]
[1,null,{"$f":"IF(ALL_A!C93=\"\",\"\",ALL_A!C93)","v":""},{"$f":"IF(ALL_A!H93=\"\",\"\",ALL_A!H93)","v":""},null,null,null,null,null,null,null,null,null,null,null,null,null,null,null,null,null,null,null,null,""]
[1,null,{"$f":"IF(ALL_A!C94=\"\",\"\",ALL_A!C94)","v":""},{"$f":"IF(ALL_A!H94=\"\",\"\",ALL_A!H94)","v":""},null,null,null,null,null,null,null,null,null,null,null,null,null,null,null,null,null,null,null,null,""]
[1,null,{"$f":"IF(ALL_A!C95=\"\",\"\",ALL_A!C95)","v":""},{"$f":"IF(ALL_A!H95=\"\",\"\",ALL_A!H95)","v":""},null,null,null,null,null,null,null,null,null,null,null,null,null,null,null,null,null,null,null,null,""]
[1,null,{"$f":"IF(ALL_A!C96=\"\",\"\",ALL_A!C96)","v":""},{"$f":"IF(ALL_A!H96=\"\",\"\",ALL_A!H96)","v":""},null,null,null,null,null,null,null,null,null,null,null,null,null,null,null,null,null,null,null,null,""]
[1,null,{"$f":"IF(ALL_A!C97=\"\",\"\",ALL_A!C97)","v":""},{"$f":"IF(ALL_A!H97=\"\",\"\",ALL_A!H97)","v":""},null,null,null,null,null,null,null,null,null,null,null,null,null,null,null,null,null,null,null,null,""]
[1,null,{"$f":"IF(ALL_A!C98=\"\",\"\",ALL_A!C98)","v":""},{"$f":"IF(ALL_A!H98=\"\",\"\",ALL_A!H98)","v":""},null,null,null,null,null,null,null,null,null,null,null,null,null,null,null,null,null,null,null,null,""]
[1,null,{"$f":"IF(ALL_A!C99=\"\",\"\",ALL_A!C99)","v":""},{"$f":"IF(ALL_A!H99=\"\",\"\",ALL_A!H99)","v":""},null,null,null,null,null,null,null,null,null,null,null,null,null,null,null,null,null,null,null,null,""]
[1,null,{"$f":"IF(ALL_A!C100=\"\",\"\",ALL_A!C100)","v":""},{"$f":"IF(ALL_A!H100=\"\",\"\",ALL_A!H100)","v":""},null,null,null,null,null,null,null,null,null,null,null,null,null,null,null,null,null,null,null,null,""]
[1,null,{"$f":"IF(ALL_A!C101=\"\",\"\",ALL_A!C101)","v":""},{"$f":"IF(ALL_A!H101=\"\",\"\",ALL_A!H101)","v":""},null,null,null,null,null,null,null,null,null,null,null,null,null,null,null,null,null,null,null,null,""]
[1,null,{"$f":"IF(ALL_A!C102=\"\",\"\",ALL_A!C102)","v":""},{"$f":"IF(ALL_A!H102=\"\",\"\",ALL_A!H102)","v":""},null,null,null,null,null,null,null,null,null,null,null,null,null,null,null,null,null,null,null,null,""]
[1,null,{"$f":"IF(ALL_A!C103=\"\",\"\",ALL_A!C103)","v":""},{"$f":"IF(ALL_A!H103=\"\",\"\",ALL_A!H103)","v":""},null,null,null,null,null,null,null,null,null,null,null,null,null,null,null,null,null,null,null,null,""]
[1,null,{"$f":"IF(ALL_A!C104=\"\",\"\",ALL_A!C104)","v":""},{"$f":"IF(ALL_A!H104=\"\",\"\",ALL_A!H104)","v":""},null,null,null,null,null,null,null,null,null,null,null,null,null,null,null,null,null,null,null,null,""]
[1,null,{"$f":"IF(ALL_A!C105=\"\",\"\",ALL_A!C105)","v":""},{"$f":"IF(ALL_A!H105=\"\",\"\",ALL_A!H105)","v":""},null,null,null,null,null,null,null,null,null,null,null,null,null,null,null,null,null,null,null,null,""]
[1,null,{"$f":"IF(ALL_A!C106=\"\",\"\",ALL_A!C106)","v":""},{"$f":"IF(ALL_A!H106=\"\",\"\",ALL_A!H106)","v":""},null,null,null,null,null,null,null,null,null,null,null,null,null,null,null,null,null,null,null,null,""]
[1,null,{"$f":"IF(ALL_A!C107=\"\",\"\",ALL_A!C107)","v":""},{"$f":"IF(ALL_A!H107=\"\",\"\",ALL_A!H107)","v":""},null,null,null,null,null,null,null,null,null,null,null,null,null,null,null,null,null,null,null,null,""]
[1,null,{"$f":"IF(ALL_A!C108=\"\",\"\",ALL_A!C108)","v":""},{"$f":"IF(ALL_A!H108=\"\",\"\",ALL_A!H108)","v":""},null,null,null,null,null,null,null,null,null,null,null,null,null,null,null,null,null,null,null,null,""]
[1,null,{"$f":"IF(ALL_A!C109=\"\",\"\",ALL_A!C109)","v":""},{"$f":"IF(ALL_A!H109=\"\",\"\",ALL_A!H109)","v":""},null,null,null,null,null,null,null,null,null,null,null,null,null,null,null,null,null,null,null,null,""]
[1,null,{"$f":"IF(ALL_A!C110=\"\",\"\",ALL_A!C110)","v":""},{"$f":"IF(ALL_A!H110=\"\",\"\",ALL_A!H110)","v":""},null,null,null,null,null,null,null,null,null,null,null,null,null,null,null,null,null,null,null,null,""]
[1,null,{"$f":"IF(ALL_A!C111=\"\",\"\",ALL_A!C111)","v":""},{"$f":"IF(ALL_A!H111=\"\",\"\",ALL_A!H111)","v":""},null,null,null,null,null,null,null,null,null,null,null,null,null,null,null,null,null,null,null,null,""]
[1,null,{"$f":"IF(ALL_A!C112=\"\",\"\",ALL_A!C112)","v":""},{"$f":"IF(ALL_A!H112=\"\",\"\",ALL_A!H112)","v":""},null,null,null,null,null,null,null,null,null,null,null,null,null,null,null,null,null,null,null,null,""]
[1,null,{"$f":"IF(ALL_A!C113=\"\",\"\",ALL_A!C113)","v":""},{"$f":"IF(ALL_A!H113=\"\",\"\",ALL_A!H113)","v":""},null,null,null,null,null,null,null,null,null,null,null,null,null,null,null,null,null,null,null,null,""]
[1,null,{"$f":"IF(ALL_A!C114=\"\",\"\",ALL_A!C114)","v":""},{"$f":"IF(ALL_A!H114=\"\",\"\",ALL_A!H114)","v":""},null,null,null,null,null,null,null,null,null,null,null,null,null,null,null,null,null,null,null,null,""]
[1,null,{"$f":"IF(ALL_A!C115=\"\",\"\",ALL_A!C115)","v":""},{"$f":"IF(ALL_A!H115=\"\",\"\",ALL_A!H115)","v":""},null,null,null,null,null,null,null,null,null,null,null,null,null,null,null,null,null,null,null,null,""]
[1,null,{"$f":"IF(ALL_A!C116=\"\",\"\",ALL_A!C116)","v":""},{"$f":"IF(ALL_A!H116=\"\",\"\",ALL_A!H116)","v":""},null,null,null,null,null,null,null,null,null,null,null,null,null,null,null,null,null,null,null,null,""]
[1,null,{"$f":"IF(ALL_A!C117=\"\",\"\",ALL_A!C117)","v":""},{"$f":"IF(ALL_A!H117=\"\",\"\",ALL_A!H117)","v":""},null,null,null,null,null,null,null,null,null,null,null,null,null,null,null,null,null,null,null,null,""]
[1,null,{"$f":"IF(ALL_A!C118=\"\",\"\",ALL_A!C118)","v":""},{"$f":"IF(ALL_A!H118=\"\",\"\",ALL_A!H118)","v":""},null,null,null,null,null,null,null,null,null,null,null,null,null,null,null,null,null,null,null,null,""]
[1,null,{"$f":"IF(ALL_A!C119=\"\",\"\",ALL_A!C119)","v":""},{"$f":"IF(ALL_A!H119=\"\",\"\",ALL_A!H119)","v":""},null,null,null,null,null,null,null,null,null,null,null,null,null,null,null,null,null,null,null,null,""]
[1,null,{"$f":"IF(ALL_A!C120=\"\",\"\",ALL_A!C120)","v":""},{"$f":"IF(ALL_A!H120=\"\",\"\",ALL_A!H120)","v":""},null,null,null,null,null,null,null,null,null,null,null,null,null,null,null,null,null,null,null,null,""]
[1,null,{"$f":"IF(ALL_A!C121=\"\",\"\",ALL_A!C121)","v":""},{"$f":"IF(ALL_A!H121=\"\",\"\",ALL_A!H121)","v":""},null,null,null,null,null,null,null,null,null,null,null,null,null,null,null,null,null,null,null,null,""]
[1,null,{"$f":"IF(ALL_A!C122=\"\",\"\",ALL_A!C122)","v":""},{"$f":"IF(ALL_A!H122=\"\",\"\",ALL_A!H122)","v":""},null,null,null,null,null,null,null,null,null,null,null,null,null,null,null,null,null,null,null,null,{"$f":"IFERROR(C67,\"#ERR\")","v":""}]
[1,null,{"$f":"IF(ALL_A!C123=\"\",\"\",ALL_A!C123)","v":""},{"$f":"IF(ALL_A!H123=\"\",\"\",ALL_A!H123)","v":""},null,null,null,null,null,null,null,null,null,null,null,null,null,null,null,null,null,null,null,null,""]
[1,null,{"$f":"IF(ALL_A!C124=\"\",\"\",ALL_A!C124)","v":""},{"$f":"IF(ALL_A!H124=\"\",\"\",ALL_A!H124)","v":""},null,null,null,null,null,null,null,null,null,null,null,null,null,null,null,null,null,null,null,null,""]
[1,null,{"$f":"IF(ALL_A!C125=\"\",\"\",ALL_A!C125)","v":""},{"$f":"IF(ALL_A!H125=\"\",\"\",ALL_A!H125)","v":""},null,null,null,null,null,null,null,null,null,null,null,null,null,null,null,null,null,null,null,null,""]
[1,null,{"$f":"IF(ALL_A!C126=\"\",\"\",ALL_A!C126)","v":""},{"$f":"IF(ALL_A!H126=\"\",\"\",ALL_A!H126)","v":""},null,null,null,null,null,null,null,null,null,null,null,null,null,null,null,null,null,null,null,null,""]
[1,null,{"$f":"IF(ALL_A!C127=\"\",\"\",ALL_A!C127)","v":""},{"$f":"IF(ALL_A!H127=\"\",\"\",ALL_A!H127)","v":""},null,null,null,null,null,null,null,null,null,null,null,null,null,null,null,null,null,null,null,null,""]
[1,null,{"$f":"IF(ALL_A!C128=\"\",\"\",ALL_A!C128)","v":""},{"$f":"IF(ALL_A!H128=\"\",\"\",ALL_A!H128)","v":""},null,null,null,null,null,null,null,null,null,null,null,null,null,null,null,null,null,null,null,null,""]
[1,null,{"$f":"IF(ALL_A!C129=\"\",\"\",ALL_A!C129)","v":""},{"$f":"IF(ALL_A!H129=\"\",\"\",ALL_A!H129)","v":""},null,null,null,null,null,null,null,null,null,null,null,null,null,null,null,null,null,null,null,null,""]
[1,null,{"$f":"IF(ALL_A!C130=\"\",\"\",ALL_A!C130)","v":""},{"$f":"IF(ALL_A!H130=\"\",\"\",ALL_A!H130)","v":""},null,null,null,null,null,null,null,null,null,null,null,null,null,null,null,null,null,null,null,null,""]
[1,null,{"$f":"IF(ALL_A!C131=\"\",\"\",ALL_A!C131)","v":""},{"$f":"IF(ALL_A!H131=\"\",\"\",ALL_A!H131)","v":""},null,null,null,null,null,null,null,null,null,null,null,null,null,null,null,null,null,null,null,null,""]
[1,null,{"$f":"IF(ALL_A!C132=\"\",\"\",ALL_A!C132)","v":""},{"$f":"IF(ALL_A!H132=\"\",\"\",ALL_A!H132)","v":""},null,null,null,null,null,null,null,null,null,null,null,null,null,null,null,null,null,null,null,null,""]
[1,null,{"$f":"IF(ALL_A!C133=\"\",\"\",ALL_A!C133)","v":""},{"$f":"IF(ALL_A!H133=\"\",\"\",ALL_A!H133)","v":""},null,null,null,null,null,null,null,null,null,null,null,null,null,null,null,null,null,null,null,null,""]
[1,null,{"$f":"IF(ALL_A!C134=\"\",\"\",ALL_A!C134)","v":""},{"$f":"IF(ALL_A!H134=\"\",\"\",ALL_A!H134)","v":""},null,null,null,null,null,null,null,null,null,null,null,null,null,null,null,null,null,null,null,null,""]
[1,null,{"$f":"IF(ALL_A!C135=\"\",\"\",ALL_A!C135)","v":""},{"$f":"IF(ALL_A!H135=\"\",\"\",ALL_A!H135)","v":""},null,null,null,null,null,null,null,null,null,null,null,null,null,null,null,null,null,null,null,null,""]
[1,null,{"$f":"IF(ALL_A!C136=\"\",\"\",ALL_A!C136)","v":""},{"$f":"IF(ALL_A!H136=\"\",\"\",ALL_A!H136)","v":""},null,null,null,null,null,null,null,null,null,null,null,null,null,null,null,null,null,null,null,null,""]
[1,null,{"$f":"IF(ALL_A!C137=\"\",\"\",ALL_A!C137)","v":""},{"$f":"IF(ALL_A!H137=\"\",\"\",ALL_A!H137)","v":""},null,null,null,null,null,null,null,null,null,null,null,null,null,null,null,null,null,null,null,null,""]
[1,null,{"$f":"IF(ALL_A!C138=\"\",\"\",ALL_A!C138)","v":""},{"$f":"IF(ALL_A!H138=\"\",\"\",ALL_A!H138)","v":""},null,null,null,null,null,null,null,null,null,null,null,null,null,null,null,null,null,null,null,null,""]
[1,null,{"$f":"IF(ALL_A!C139=\"\",\"\",ALL_A!C139)","v":""},{"$f":"IF(ALL_A!H139=\"\",\"\",ALL_A!H139)","v":""},null,null,null,null,null,null,null,null,null,null,null,null,null,null,null,null,null,null,null,null,""]
[1,null,{"$f":"IF(ALL_A!C140=\"\",\"\",ALL_A!C140)","v":""},{"$f":"IF(ALL_A!H140=\"\",\"\",ALL_A!H140)","v":""},null,null,null,null,null,null,null,null,null,null,null,null,null,null,null,null,null,null,null,null,""]
[1,null,{"$f":"IF(ALL_A!C141=\"\",\"\",ALL_A!C141)","v":""},{"$f":"IF(ALL_A!H141=\"\",\"\",ALL_A!H141)","v":""},null,null,null,null,null,null,null,null,null,null,null,null,null,null,null,null,null,null,null,null,""]
[1,null,{"$f":"IF(ALL_A!C142=\"\",\"\",ALL_A!C142)","v":""},{"$f":"IF(ALL_A!H142=\"\",\"\",ALL_A!H142)","v":""},null,null,null,null,null,null,null,null,null,null,null,null,null,null,null,null,null,null,null,null,""]
[1,null,{"$f":"IF(ALL_A!C143=\"\",\"\",ALL_A!C143)","v":""},{"$f":"IF(ALL_A!H143=\"\",\"\",ALL_A!H143)","v":""},null,null,null,null,null,null,null,null,null,null,null,null,null,null,null,null,null,null,null,null,""]
[1,null,{"$f":"IF(ALL_A!C144=\"\",\"\",ALL_A!C144)","v":""},{"$f":"IF(ALL_A!H144=\"\",\"\",ALL_A!H144)","v":""},null,null,null,null,null,null,null,null,null,null,null,null,null,null,null,null,null,null,null,null,""]
[1,null,{"$f":"IF(ALL_A!C145=\"\",\"\",ALL_A!C145)","v":""},{"$f":"IF(ALL_A!H145=\"\",\"\",ALL_A!H145)","v":""},null,null,null,null,null,null,null,null,null,null,null,null,null,null,null,null,null,null,null,null,""]
[1,null,{"$f":"IF(ALL_A!C146=\"\",\"\",ALL_A!C146)","v":""},{"$f":"IF(ALL_A!H146=\"\",\"\",ALL_A!H146)","v":""},null,null,null,null,null,null,null,null,null,null,null,null,null,null,null,null,null,null,null,null,""]
[1,null,{"$f":"IF(ALL_A!C147=\"\",\"\",ALL_A!C147)","v":""},{"$f":"IF(ALL_A!H147=\"\",\"\",ALL_A!H147)","v":""},null,null,null,null,null,null,null,null,null,null,null,null,null,null,null,null,null,null,null,null,""]
[1,null,{"$f":"IF(ALL_A!C148=\"\",\"\",ALL_A!C148)","v":""},{"$f":"IF(ALL_A!H148=\"\",\"\",ALL_A!H148)","v":""},null,null,null,null,null,null,null,null,null,null,null,null,null,null,null,null,null,null,null,null,""]
[1,null,{"$f":"IF(ALL_A!C149=\"\",\"\",ALL_A!C149)","v":""},{"$f":"IF(ALL_A!H149=\"\",\"\",ALL_A!H149)","v":""},null,null,null,null,null,null,null,null,null,null,null,null,null,null,null,null,null,null,null,null,""]
[1,null,{"$f":"IF(ALL_A!C150=\"\",\"\",ALL_A!C150)","v":""},{"$f":"IF(ALL_A!H150=\"\",\"\",ALL_A!H150)","v":""},null,null,null,null,null,null,null,null,null,null,null,null,null,null,null,null,null,null,null,null,""]
[1,null,{"$f":"IF(ALL_A!C151=\"\",\"\",ALL_A!C151)","v":""},{"$f":"IF(ALL_A!H151=\"\",\"\",ALL_A!H151)","v":""},null,null,null,null,null,null,null,null,null,null,null,null,null,null,null,null,null,null,null,null,""]
[1,null,{"$f":"IF(ALL_A!C152=\"\",\"\",ALL_A!C152)","v":""},{"$f":"IF(ALL_A!H152=\"\",\"\",ALL_A!H152)","v":""},null,null,null,null,null,null,null,null,null,null,null,null,null,null,null,null,null,null,null,null,""]
[1,null,{"$f":"IF(ALL_A!C153=\"\",\"\",ALL_A!C153)","v":""},{"$f":"IF(ALL_A!H153=\"\",\"\",ALL_A!H153)","v":""},null,null,null,null,null,null,null,null,null,null,null,null,null,null,null,null,null,null,null,null,""]
[1,null,{"$f":"IF(ALL_A!C154=\"\",\"\",ALL_A!C154)","v":""},{"$f":"IF(ALL_A!H154=\"\",\"\",ALL_A!H154)","v":""},null,null,null,null,null,null,null,null,null,null,null,null,null,null,null,null,null,null,null,null,""]
[1,null,{"$f":"IF(ALL_A!C155=\"\",\"\",ALL_A!C155)","v":""},{"$f":"IF(ALL_A!H155=\"\",\"\",ALL_A!H155)","v":""},null,null,null,null,null,null,null,null,null,null,null,null,null,null,null,null,null,null,null,null,""]
[1,null,{"$f":"IF(ALL_A!C156=\"\",\"\",ALL_A!C156)","v":""},{"$f":"IF(ALL_A!H156=\"\",\"\",ALL_A!H156)","v":""},null,null,null,null,null,null,null,null,null,null,null,null,null,null,null,null,null,null,null,null,""]
[1,null,{"$f":"IF(ALL_A!C157=\"\",\"\",ALL_A!C157)","v":""},{"$f":"IF(ALL_A!H157=\"\",\"\",ALL_A!H157)","v":""},null,null,null,null,null,null,null,null,null,null,null,null,null,null,null,null,null,null,null,null,""]
[1,null,{"$f":"IF(ALL_A!C158=\"\",\"\",ALL_A!C158)","v":""},{"$f":"IF(ALL_A!H158=\"\",\"\",ALL_A!H158)","v":""},null,null,null,null,null,null,null,null,null,null,null,null,null,null,null,null,null,null,null,null,""]
[1,null,{"$f":"IF(ALL_A!C159=\"\",\"\",ALL_A!C159)","v":""},{"$f":"IF(ALL_A!H159=\"\",\"\",ALL_A!H159)","v":""},null,null,null,null,null,null,null,null,null,null,null,null,null,null,null,null,null,null,null,null,""]
[1,null,{"$f":"IF(ALL_A!C160=\"\",\"\",ALL_A!C160)","v":""},{"$f":"IF(ALL_A!H160=\"\",\"\",ALL_A!H160)","v":""},null,null,null,null,null,null,null,null,null,null,null,null,null,null,null,null,null,null,null,null,""]
[1,null,{"$f":"IF(ALL_A!C161=\"\",\"\",ALL_A!C161)","v":""},{"$f":"IF(ALL_A!H161=\"\",\"\",ALL_A!H161)","v":""},null,null,null,null,null,null,null,null,null,null,null,null,null,null,null,null,null,null,null,null,""]
[1,null,{"$f":"IF(ALL_A!C162=\"\",\"\",ALL_A!C162)","v":""},{"$f":"IF(ALL_A!H162=\"\",\"\",ALL_A!H162)","v":""},null,null,null,null,null,null,null,null,null,null,null,null,null,null,null,null,null,null,null,null,""]
[1,null,{"$f":"IF(ALL_A!C163=\"\",\"\",ALL_A!C163)","v":""},{"$f":"IF(ALL_A!H163=\"\",\"\",ALL_A!H163)","v":""},null,null,null,null,null,null,null,null,null,null,null,null,null,null,null,null,null,null,null,null,""]
[1,null,{"$f":"IF(ALL_A!C164=\"\",\"\",ALL_A!C164)","v":""},{"$f":"IF(ALL_A!H164=\"\",\"\",ALL_A!H164)","v":""},null,null,null,null,null,null,null,null,null,null,null,null,null,null,null,null,null,null,null,null,""]
[1,null,{"$f":"IF(ALL_A!C165=\"\",\"\",ALL_A!C165)","v":""},{"$f":"IF(ALL_A!H165=\"\",\"\",ALL_A!H165)","v":""},null,null,null,null,null,null,null,null,null,null,null,null,null,null,null,null,null,null,null,null,""]
[1,null,{"$f":"IF(ALL_A!C166=\"\",\"\",ALL_A!C166)","v":""},{"$f":"IF(ALL_A!H166=\"\",\"\",ALL_A!H166)","v":""},null,null,null,null,null,null,null,null,null,null,null,null,null,null,null,null,null,null,null,null,""]
[1,null,{"$f":"IF(ALL_A!C167=\"\",\"\",ALL_A!C167)","v":""},{"$f":"IF(ALL_A!H167=\"\",\"\",ALL_A!H167)","v":""},null,null,null,null,null,null,null,null,null,null,null,null,null,null,null,null,null,null,null,null,""]
[1,null,{"$f":"IF(ALL_A!C168=\"\",\"\",ALL_A!C168)","v":""},{"$f":"IF(ALL_A!H168=\"\",\"\",ALL_A!H168)","v":""},null,null,null,null,null,null,null,null,null,null,null,null,null,null,null,null,null,null,null,null,""]
[1,null,{"$f":"IF(ALL_A!C169=\"\",\"\",ALL_A!C169)","v":""},{"$f":"IF(ALL_A!H169=\"\",\"\",ALL_A!H169)","v":""},null,null,null,null,null,null,null,null,null,null,null,null,null,null,null,null,null,null,null,null,""]
[1,null,{"$f":"IF(ALL_A!C170=\"\",\"\",ALL_A!C170)","v":""},{"$f":"IF(ALL_A!H170=\"\",\"\",ALL_A!H170)","v":""},null,null,null,null,null,null,null,null,null,null,null,null,null,null,null,null,null,null,null,null,""]
[1,null,{"$f":"IF(ALL_A!C171=\"\",\"\",ALL_A!C171)","v":""},{"$f":"IF(ALL_A!H171=\"\",\"\",ALL_A!H171)","v":""},null,null,null,null,null,null,null,null,null,null,null,null,null,null,null,null,null,null,null,null,""]
[1,null,{"$f":"IF(ALL_A!C172=\"\",\"\",ALL_A!C172)","v":""},{"$f":"IF(ALL_A!H172=\"\",\"\",ALL_A!H172)","v":""},null,null,null,null,null,null,null,null,null,null,null,null,null,null,null,null,null,null,null,null,""]
[1,null,{"$f":"IF(ALL_A!C173=\"\",\"\",ALL_A!C173)","v":""},{"$f":"IF(ALL_A!H173=\"\",\"\",ALL_A!H173)","v":""},null,null,null,null,null,null,null,null,null,null,null,null,null,null,null,null,null,null,null,null,""]
[1,null,{"$f":"IF(ALL_A!C174=\"\",\"\",ALL_A!C174)","v":""},{"$f":"IF(ALL_A!H174=\"\",\"\",ALL_A!H174)","v":""},null,null,null,null,null,null,null,null,null,null,null,null,null,null,null,null,null,null,null,null,""]
[1,null,{"$f":"IF(ALL_A!C175=\"\",\"\",ALL_A!C175)","v":""},{"$f":"IF(ALL_A!H175=\"\",\"\",ALL_A!H175)","v":""},null,null,null,null,null,null,null,null,null,null,null,null,null,null,null,null,null,null,null,null,""]
[1,null,{"$f":"IF(ALL_A!C176=\"\",\"\",ALL_A!C176)","v":""},{"$f":"IF(ALL_A!H176=\"\",\"\",ALL_A!H176)","v":""},null,null,null,null,null,null,null,null,null,null,null,null,null,null,null,null,null,null,null,null,""]
[1,null,{"$f":"IF(ALL_A!C177=\"\",\"\",ALL_A!C177)","v":""},{"$f":"IF(ALL_A!H177=\"\",\"\",ALL_A!H177)","v":""},null,null,null,null,null,null,null,null,null,null,null,null,null,null,null,null,null,null,null,null,""]
[1,null,{"$f":"IF(ALL_A!C178=\"\",\"\",ALL_A!C178)","v":""},{"$f":"IF(ALL_A!H178=\"\",\"\",ALL_A!H178)","v":""},null,null,null,null,null,null,null,null,null,null,null,null,null,null,null,null,null,null,null,null,""]
[1,null,{"$f":"IF(ALL_A!C179=\"\",\"\",ALL_A!C179)","v":""},{"$f":"IF(ALL_A!H179=\"\",\"\",ALL_A!H179)","v":""},null,null,null,null,null,null,null,null,null,null,null,null,null,null,null,null,null,null,null,null,""]
[1,null,{"$f":"IF(ALL_A!C180=\"\",\"\",ALL_A!C180)","v":""},{"$f":"IF(ALL_A!H180=\"\",\"\",ALL_A!H180)","v":""},null,null,null,null,null,null,null,null,null,null,null,null,null,null,null,null,null,null,null,null,""]
[1,null,{"$f":"IF(ALL_A!C181=\"\",\"\",ALL_A!C181)","v":""},{"$f":"IF(ALL_A!H181=\"\",\"\",ALL_A!H181)","v":""},null,null,null,null,null,null,null,null,null,null,null,null,null,null,null,null,null,null,null,null,""]
[1,null,{"$f":"IF(ALL_A!C182=\"\",\"\",ALL_A!C182)","v":""},{"$f":"IF(ALL_A!H182=\"\",\"\",ALL_A!H182)","v":""},null,null,null,null,null,null,null,null,null,null,null,null,null,null,null,null,null,null,null,null,""]
[1,null,{"$f":"IF(ALL_A!C183=\"\",\"\",ALL_A!C183)","v":""},{"$f":"IF(ALL_A!H183=\"\",\"\",ALL_A!H183)","v":""},null,null,null,null,null,null,null,null,null,null,null,null,null,null,null,null,null,null,null,null,""]
[1,null,{"$f":"IF(ALL_A!C184=\"\",\"\",ALL_A!C184)","v":""},{"$f":"IF(ALL_A!H184=\"\",\"\",ALL_A!H184)","v":""},null,null,null,null,null,null,null,null,null,null,null,null,null,null,null,null,null,null,null,null,""]
[1,null,{"$f":"IF(ALL_A!C185=\"\",\"\",ALL_A!C185)","v":""},{"$f":"IF(ALL_A!H185=\"\",\"\",ALL_A!H185)","v":""},null,null,null,null,null,null,null,null,null,null,null,null,null,null,null,null,null,null,null,null,""]
[1,null,{"$f":"IF(ALL_A!C186=\"\",\"\",ALL_A!C186)","v":""},{"$f":"IF(ALL_A!H186=\"\",\"\",ALL_A!H186)","v":""},null,null,null,null,null,null,null,null,null,null,null,null,null,null,null,null,null,null,null,null,{"$f":"IFERROR(C131,\"#ERR\")","v":""}]
[1,null,{"$f":"IF(ALL_A!C187=\"\",\"\",ALL_A!C187)","v":""},{"$f":"IF(ALL_A!H187=\"\",\"\",ALL_A!H187)","v":""},null,null,null,null,null,null,null,null,null,null,null,null,null,null,null,null,null,null,null,null,""]
[1,null,{"$f":"IF(ALL_A!C188=\"\",\"\",ALL_A!C188)","v":""},{"$f":"IF(ALL_A!H188=\"\",\"\",ALL_A!H188)","v":""},null,null,null,null,null,null,null,null,null,null,null,null,null,null,null,null,null,null,null,null,""]
[1,null,{"$f":"IF(ALL_A!C189=\"\",\"\",ALL_A!C189)","v":""},{"$f":"IF(ALL_A!H189=\"\",\"\",ALL_A!H189)","v":""},null,null,null,null,null,null,null,null,null,null,null,null,null,null,null,null,null,null,null,null,""]
[1,null,{"$f":"IF(ALL_A!C190=\"\",\"\",ALL_A!C190)","v":""},{"$f":"IF(ALL_A!H190=\"\",\"\",ALL_A!H190)","v":""},null,null,null,null,null,null,null,null,null,null,null,null,null,null,null,null,null,null,null,null,""]
[1,null,{"$f":"IF(ALL_A!C191=\"\",\"\",ALL_A!C191)","v":""},{"$f":"IF(ALL_A!H191=\"\",\"\",ALL_A!H191)","v":""},null,null,null,null,null,null,null,null,null,null,null,null,null,null,null,null,null,null,null,null,""]
[1,null,{"$f":"IF(ALL_A!C192=\"\",\"\",ALL_A!C192)","v":""},{"$f":"IF(ALL_A!H192=\"\",\"\",ALL_A!H192)","v":""},null,null,null,null,null,null,null,null,null,null,null,null,null,null,null,null,null,null,null,null,""]
[1,null,{"$f":"IF(ALL_A!C193=\"\",\"\",ALL_A!C193)","v":""},{"$f":"IF(ALL_A!H193=\"\",\"\",ALL_A!H193)","v":""},null,null,null,null,null,null,null,null,null,null,null,null,null,null,null,null,null,null,null,null,""]
[1,null,{"$f":"IF(ALL_A!C194=\"\",\"\",ALL_A!C194)","v":""},{"$f":"IF(ALL_A!H194=\"\",\"\",ALL_A!H194)","v":""},null,null,null,null,null,null,null,null,null,null,null,null,null,null,null,null,null,null,null,null,""]
[1,null,{"$f":"IF(ALL_A!C195=\"\",\"\",ALL_A!C195)","v":""},{"$f":"IF(ALL_A!H195=\"\",\"\",ALL_A!H195)","v":""},null,null,null,null,null,null,null,null,null,null,null,null,null,null,null,null,null,null,null,null,""]
[1,null,{"$f":"IF(ALL_A!C196=\"\",\"\",ALL_A!C196)","v":""},{"$f":"IF(ALL_A!H196=\"\",\"\",ALL_A!H196)","v":""},null,null,null,null,null,null,null,null,null,null,null,null,null,null,null,null,null,null,null,null,""]
[1,null,{"$f":"IF(ALL_A!C197=\"\",\"\",ALL_A!C197)","v":""},{"$f":"IF(ALL_A!H197=\"\",\"\",ALL_A!H197)","v":""},null,null,null,null,null,null,null,null,null,null,null,null,null,null,null,null,null,null,null,null,""]
[1,null,{"$f":"IF(ALL_A!C198=\"\",\"\",ALL_A!C198)","v":""},{"$f":"IF(ALL_A!H198=\"\",\"\",ALL_A!H198)","v":""},null,null,null,null,null,null,null,null,null,null,null,null,null,null,null,null,null,null,null,null,""]
[1,null,{"$f":"IF(ALL_A!C199=\"\",\"\",ALL_A!C199)","v":""},{"$f":"IF(ALL_A!H199=\"\",\"\",ALL_A!H199)","v":""},null,null,null,null,null,null,null,null,null,null,null,null,null,null,null,null,null,null,null,null,""]
[1,null,{"$f":"IF(ALL_A!C200=\"\",\"\",ALL_A!C200)","v":""},{"$f":"IF(ALL_A!H200=\"\",\"\",ALL_A!H200)","v":""},null,null,null,null,null,null,null,null,null,null,null,null,null,null,null,null,null,null,null,null,""]
[1,null,{"$f":"IF(ALL_A!C201=\"\",\"\",ALL_A!C201)","v":""},{"$f":"IF(ALL_A!H201=\"\",\"\",ALL_A!H201)","v":""},null,null,null,null,null,null,null,null,null,null,null,null,null,null,null,null,null,null,null,null,""]

{"sheet":"EXP_ADDETTI_ANNO_CONTRATTO","index":15,"n_rows":16,"n_cols":27,"rows_kept":16,"cut":false,"hidden":true,"merged":[]}
["ID","ID_PROGRAMMA","ID_TIPO_CONTRATTO","ANNO","NUMERO_ADDETTI",null,"ID","DESCRIZIONE"]
[1,null,1,{"$f":"ALL_A!$F$210","v":2017},{"$f":"ALL_A!F211","v":0},null,1,"DIRIGENTI",null,null,null,null,null,null,null,null,null,null,null,null,null,null,null,null,null,{"$f":"IFERROR(SUM(C2:E16),\"#ERR\")","v":30315},{"$f":"COUNTIF(X:Z,\"#ERR\")","v":0}]
[1,null,1,{"$f":"D2+1","v":2018},{"$f":"ALL_A!G211","v":0},null,2,"IMPIEGATI"]
[1,null,1,{"$f":"D3+1","v":2019},{"$f":"ALL_A!H211","v":0},null,3,"OPERAI"]
[1,null,2,{"$f":"ALL_A!$F$210","v":2017},{"$f":"ALL_A!F212","v":0},null,4,"CIG"]
[1,null,2,{"$f":"D5+1","v":2018},{"$f":"ALL_A!G212","v":0},null,5," RICERCATORI/TECNICI"]
[1,null,2,{"$f":"D6+1","v":2019},{"$f":"ALL_A!H212","v":0}]
[1,null,3,{"$f":"ALL_A!$F$210","v":2017},{"$f":"ALL_A!F213","v":0}]
[1,null,3,{"$f":"D8+1","v":2018},{"$f":"ALL_A!G213","v":0}]
[1,null,3,{"$f":"D9+1","v":2019},{"$f":"ALL_A!H213","v":0}]
[1,null,4,{"$f":"ALL_A!$F$210","v":2017},{"$f":"ALL_A!F215","v":0}]
[1,null,4,{"$f":"D11+1","v":2018},{"$f":"ALL_A!G215","v":0}]
[1,null,4,{"$f":"D12+1","v":2019},{"$f":"ALL_A!H215","v":0}]
[1,null,5,{"$f":"ALL_A!$F$210","v":2017},{"$f":"ALL_A!F216","v":0}]
[1,null,5,{"$f":"D14+1","v":2018},{"$f":"ALL_A!G216","v":0}]
[1,null,5,{"$f":"D15+1","v":2019},{"$f":"ALL_A!H216","v":0}]

{"sheet":"EXP_ADDETTI_ANNO_ISTRUZIONE","index":16,"n_rows":10,"n_cols":27,"rows_kept":10,"cut":false,"hidden":true,"merged":[]}
["ID","ID_PROGRAMMA","ID_TIPO_ISTRUZIONE","ANNO","NUMERO_ADDETTI",null,null,"ID","DESCRIZIONE"]
[1,null,1,{"$f":"ALL_A!$F$210","v":2017},{"$f":"ALL_A!F219","v":0},null,null,1,"LAUREATI",null,null,null,null,null,null,null,null,null,null,null,null,null,null,null,null,{"$f":"IFERROR(SUM(C2:E10),\"#ERR\")","v":18180},{"$f":"COUNTIF(X:Z,\"#ERR\")","v":0}]
[1,null,1,{"$f":"D2+1","v":2018},{"$f":"ALL_A!F220","v":0},null,null,2,"DIPLOMATI"]
[1,null,1,{"$f":"D3+1","v":2019},{"$f":"ALL_A!F221","v":0},null,null,3,"ALTRI"]
[1,null,2,{"$f":"ALL_A!$F$210","v":2017},{"$f":"ALL_A!G219","v":0}]
[1,null,2,{"$f":"D5+1","v":2018},{"$f":"ALL_A!G220","v":0}]
[1,null,2,{"$f":"D6+1","v":2019},{"$f":"ALL_A!G221","v":0}]
[1,null,3,{"$f":"ALL_A!$F$210","v":2017},{"$f":"ALL_A!H219","v":0}]
[1,null,3,{"$f":"D8+1","v":2018},{"$f":"ALL_A!H220","v":0}]
[1,null,3,{"$f":"D9+1","v":2019},{"$f":"ALL_A!H221","v":0}]

{"sheet":"EXP_PARTECIPAZIONI","index":17,"n_rows":146,"n_cols":27,"rows_kept":146,"cut":false,"hidden":true,"merged":[]}
["ID","ID_PROGRAMMA","PARTECIPATA","QUOTA_PERC","SETTORE_ATTIVITA"]
[1,null,{"$f":"IF(ALL_A!C226=\"\",\"\",ALL_A!C226)","v":""},{"$f":"IF(ALL_A!G226=\"\",\"\",ALL_A!G226)","v":""},{"$f":"IF(ALL_A!H226=\"\",\"\",ALL_A!H226)","v":""},null,null,null,null,null,null,null,null,null,null,null,null,null,null,null,null,null,null,{"$f":"IFERROR(C2,\"#ERR\")","v":""},{"$f":"IFERROR(D2,\"#ERR\")","v":""},{"$f":"IFERROR(E2,\"#ERR\")","v":""},{"$f":"COUNTIF(X:Z,\"#ERR\")","v":0}]
[1,null,{"$f":"IF(ALL_A!C227=\"\",\"\",ALL_A!C227)","v":""},{"$f":"IF(ALL_A!G227=\"\",\"\",ALL_A!G227)","v":""},{"$f":"IF(ALL_A!H227=\"\",\"\",ALL_A!H227)","v":""},null,null,null,null,null,null,null,null,null,null,null,null,null,null,null,null,null,null,{"$f":"IFERROR(C3,\"#ERR\")","v":""},{"$f":"IFERROR(D3,\"#ERR\")","v":""},{"$f":"IFERROR(E3,\"#ERR\")","v":""}]
[1,null,{"$f":"IF(ALL_A!C228=\"\",\"\",ALL_A!C228)","v":""},{"$f":"IF(ALL_A!G228=\"\",\"\",ALL_A!G228)","v":""},{"$f":"IF(ALL_A!H228=\"\",\"\",ALL_A!H228)","v":""},null,null,null,null,null,null,null,null,null,null,null,null,null,null,null,null,null,null,"","",""]
[1,null,{"$f":"IF(ALL_A!C229=\"\",\"\",ALL_A!C229)","v":""},{"$f":"IF(ALL_A!G229=\"\",\"\",ALL_A!G229)","v":""},{"$f":"IF(ALL_A!H229=\"\",\"\",ALL_A!H229)","v":""},null,null,null,null,null,null,null,null,null,null,null,null,null,null,null,null,null,null,"","",""]
[1,null,{"$f":"IF(ALL_A!C230=\"\",\"\",ALL_A!C230)","v":""},{"$f":"IF(ALL_A!G230=\"\",\"\",ALL_A!G230)","v":""},{"$f":"IF(ALL_A!H230=\"\",\"\",ALL_A!H230)","v":""},null,null,null,null,null,null,null,null,null,null,null,null,null,null,null,null,null,null,"","",""]
[1,null,{"$f":"IF(ALL_A!C231=\"\",\"\",ALL_A!C231)","v":""},{"$f":"IF(ALL_A!G231=\"\",\"\",ALL_A!G231)","v":""},{"$f":"IF(ALL_A!H231=\"\",\"\",ALL_A!H231)","v":""},null,null,null,null,null,null,null,null,null,null,null,null,null,null,null,null,null,null,"","",""]
[1,null,{"$f":"IF(ALL_A!C232=\"\",\"\",ALL_A!C232)","v":""},{"$f":"IF(ALL_A!G232=\"\",\"\",ALL_A!G232)","v":""},{"$f":"IF(ALL_A!H232=\"\",\"\",ALL_A!H232)","v":""},null,null,null,null,null,null,null,null,null,null,null,null,null,null,null,null,null,null,"","",""]
[1,null,{"$f":"IF(ALL_A!C233=\"\",\"\",ALL_A!C233)","v":""},{"$f":"IF(ALL_A!G233=\"\",\"\",ALL_A!G233)","v":""},{"$f":"IF(ALL_A!H233=\"\",\"\",ALL_A!H233)","v":""},null,null,null,null,null,null,null,null,null,null,null,null,null,null,null,null,null,null,"","",""]
[1,null,{"$f":"IF(ALL_A!C234=\"\",\"\",ALL_A!C234)","v":""},{"$f":"IF(ALL_A!G234=\"\",\"\",ALL_A!G234)","v":""},{"$f":"IF(ALL_A!H234=\"\",\"\",ALL_A!H234)","v":""},null,null,null,null,null,null,null,null,null,null,null,null,null,null,null,null,null,null,"","",""]
[1,null,{"$f":"IF(ALL_A!C235=\"\",\"\",ALL_A!C235)","v":""},{"$f":"IF(ALL_A!G235=\"\",\"\",ALL_A!G235)","v":""},{"$f":"IF(ALL_A!H235=\"\",\"\",ALL_A!H235)","v":""},null,null,null,null,null,null,null,null,null,null,null,null,null,null,null,null,null,null,"","",""]
[1,null,{"$f":"IF(ALL_A!C236=\"\",\"\",ALL_A!C236)","v":""},{"$f":"IF(ALL_A!G236=\"\",\"\",ALL_A!G236)","v":""},{"$f":"IF(ALL_A!H236=\"\",\"\",ALL_A!H236)","v":""},null,null,null,null,null,null,null,null,null,null,null,null,null,null,null,null,null,null,"","",""]
[1,null,{"$f":"IF(ALL_A!C237=\"\",\"\",ALL_A!C237)","v":""},{"$f":"IF(ALL_A!G237=\"\",\"\",ALL_A!G237)","v":""},{"$f":"IF(ALL_A!H237=\"\",\"\",ALL_A!H237)","v":""},null,null,null,null,null,null,null,null,null,null,null,null,null,null,null,null,null,null,"","",""]
[1,null,{"$f":"IF(ALL_A!C238=\"\",\"\",ALL_A!C238)","v":""},{"$f":"IF(ALL_A!G238=\"\",\"\",ALL_A!G238)","v":""},{"$f":"IF(ALL_A!H238=\"\",\"\",ALL_A!H238)","v":""},null,null,null,null,null,null,null,null,null,null,null,null,null,null,null,null,null,null,"","",""]
[1,null,{"$f":"IF(ALL_A!C239=\"\",\"\",ALL_A!C239)","v":""},{"$f":"IF(ALL_A!G239=\"\",\"\",ALL_A!G239)","v":""},{"$f":"IF(ALL_A!H239=\"\",\"\",ALL_A!H239)","v":""},null,null,null,null,null,null,null,null,null,null,null,null,null,null,null,null,null,null,"","",""]
[1,null,{"$f":"IF(ALL_A!C240=\"\",\"\",ALL_A!C240)","v":""},{"$f":"IF(ALL_A!G240=\"\",\"\",ALL_A!G240)","v":""},{"$f":"IF(ALL_A!H240=\"\",\"\",ALL_A!H240)","v":""},null,null,null,null,null,null,null,null,null,null,null,null,null,null,null,null,null,null,"","",""]
[1,null,{"$f":"IF(ALL_A!C241=\"\",\"\",ALL_A!C241)","v":""},{"$f":"IF(ALL_A!G241=\"\",\"\",ALL_A!G241)","v":""},{"$f":"IF(ALL_A!H241=\"\",\"\",ALL_A!H241)","v":""},null,null,null,null,null,null,null,null,null,null,null,null,null,null,null,null,null,null,"","",""]
[1,null,{"$f":"IF(ALL_A!C242=\"\",\"\",ALL_A!C242)","v":""},{"$f":"IF(ALL_A!G242=\"\",\"\",ALL_A!G242)","v":""},{"$f":"IF(ALL_A!H242=\"\",\"\",ALL_A!H242)","v":""},null,null,null,null,null,null,null,null,null,null,null,null,null,null,null,null,null,null,"","",""]
[1,null,{"$f":"IF(ALL_A!C243=\"\",\"\",ALL_A!C243)","v":""},{"$f":"IF(ALL_A!G243=\"\",\"\",ALL_A!G243)","v":""},{"$f":"IF(ALL_A!H243=\"\",\"\",ALL_A!H243)","v":""},null,null,null,null,null,null,null,null,null,null,null,null,null,null,null,null,null,null,"","",""]
[1,null,{"$f":"IF(ALL_A!C244=\"\",\"\",ALL_A!C244)","v":""},{"$f":"IF(ALL_A!G244=\"\",\"\",ALL_A!G244)","v":""},{"$f":"IF(ALL_A!H244=\"\",\"\",ALL_A!H244)","v":""},null,null,null,null,null,null,null,null,null,null,null,null,null,null,null,null,null,null,"","",""]
[1,null,{"$f":"IF(ALL_A!C245=\"\",\"\",ALL_A!C245)","v":""},{"$f":"IF(ALL_A!G245=\"\",\"\",ALL_A!G245)","v":""},{"$f":"IF(ALL_A!H245=\"\",\"\",ALL_A!H245)","v":""},null,null,null,null,null,null,null,null,null,null,null,null,null,null,null,null,null,null,"","",""]
[1,null,{"$f":"IF(ALL_A!C246=\"\",\"\",ALL_A!C246)","v":""},{"$f":"IF(ALL_A!G246=\"\",\"\",ALL_A!G246)","v":""},{"$f":"IF(ALL_A!H246=\"\",\"\",ALL_A!H246)","v":""},null,null,null,null,null,null,null,null,null,null,null,null,null,null,null,null,null,null,"","",""]
[1,null,{"$f":"IF(ALL_A!C247=\"\",\"\",ALL_A!C247)","v":""},{"$f":"IF(ALL_A!G247=\"\",\"\",ALL_A!G247)","v":""},{"$f":"IF(ALL_A!H247=\"\",\"\",ALL_A!H247)","v":""},null,null,null,null,null,null,null,null,null,null,null,null,null,null,null,null,null,null,"","",""]
[1,null,{"$f":"IF(ALL_A!C248=\"\",\"\",ALL_A!C248)","v":""},{"$f":"IF(ALL_A!G248=\"\",\"\",ALL_A!G248)","v":""},{"$f":"IF(ALL_A!H248=\"\",\"\",ALL_A!H248)","v":""},null,null,null,null,null,null,null,null,null,null,null,null,null,null,null,null,null,null,"","",""]
[1,null,{"$f":"IF(ALL_A!C249=\"\",\"\",ALL_A!C249)","v":""},{"$f":"IF(ALL_A!G249=\"\",\"\",ALL_A!G249)","v":""},{"$f":"IF(ALL_A!H249=\"\",\"\",ALL_A!H249)","v":""},null,null,null,null,null,null,null,null,null,null,null,null,null,null,null,null,null,null,"","",""]
[1,null,{"$f":"IF(ALL_A!C250=\"\",\"\",ALL_A!C250)","v":""},{"$f":"IF(ALL_A!G250=\"\",\"\",ALL_A!G250)","v":""},{"$f":"IF(ALL_A!H250=\"\",\"\",ALL_A!H250)","v":""},null,null,null,null,null,null,null,null,null,null,null,null,null,null,null,null,null,null,"","",""]
[1,null,{"$f":"IF(ALL_A!C251=\"\",\"\",ALL_A!C251)","v":""},{"$f":"IF(ALL_A!G251=\"\",\"\",ALL_A!G251)","v":""},{"$f":"IF(ALL_A!H251=\"\",\"\",ALL_A!H251)","v":""},null,null,null,null,null,null,null,null,null,null,null,null,null,null,null,null,null,null,"","",""]
[1,null,{"$f":"IF(ALL_A!C252=\"\",\"\",ALL_A!C252)","v":""},{"$f":"IF(ALL_A!G252=\"\",\"\",ALL_A!G252)","v":""},{"$f":"IF(ALL_A!H252=\"\",\"\",ALL_A!H252)","v":""},null,null,null,null,null,null,null,null,null,null,null,null,null,null,null,null,null,null,"","",""]
[1,null,{"$f":"IF(ALL_A!C253=\"\",\"\",ALL_A!C253)","v":""},{"$f":"IF(ALL_A!G253=\"\",\"\",ALL_A!G253)","v":""},{"$f":"IF(ALL_A!H253=\"\",\"\",ALL_A!H253)","v":""},null,null,null,null,null,null,null,null,null,null,null,null,null,null,null,null,null,null,"","",""]
[1,null,{"$f":"IF(ALL_A!C254=\"\",\"\",ALL_A!C254)","v":""},{"$f":"IF(ALL_A!G254=\"\",\"\",ALL_A!G254)","v":""},{"$f":"IF(ALL_A!H254=\"\",\"\",ALL_A!H254)","v":""},null,null,null,null,null,null,null,null,null,null,null,null,null,null,null,null,null,null,"","",""]
[1,null,{"$f":"IF(ALL_A!C255=\"\",\"\",ALL_A!C255)","v":""},{"$f":"IF(ALL_A!G255=\"\",\"\",ALL_A!G255)","v":""},{"$f":"IF(ALL_A!H255=\"\",\"\",ALL_A!H255)","v":""},null,null,null,null,null,null,null,null,null,null,null,null,null,null,null,null,null,null,"","",""]
[1,null,{"$f":"IF(ALL_A!C256=\"\",\"\",ALL_A!C256)","v":""},{"$f":"IF(ALL_A!G256=\"\",\"\",ALL_A!G256)","v":""},{"$f":"IF(ALL_A!H256=\"\",\"\",ALL_A!H256)","v":""},null,null,null,null,null,null,null,null,null,null,null,null,null,null,null,null,null,null,"","",""]
[1,null,{"$f":"IF(ALL_A!C257=\"\",\"\",ALL_A!C257)","v":""},{"$f":"IF(ALL_A!G257=\"\",\"\",ALL_A!G257)","v":""},{"$f":"IF(ALL_A!H257=\"\",\"\",ALL_A!H257)","v":""},null,null,null,null,null,null,null,null,null,null,null,null,null,null,null,null,null,null,"","",""]
[1,null,{"$f":"IF(ALL_A!C258=\"\",\"\",ALL_A!C258)","v":""},{"$f":"IF(ALL_A!G258=\"\",\"\",ALL_A!G258)","v":""},{"$f":"IF(ALL_A!H258=\"\",\"\",ALL_A!H258)","v":""},null,null,null,null,null,null,null,null,null,null,null,null,null,null,null,null,null,null,"","",""]
[1,null,{"$f":"IF(ALL_A!C259=\"\",\"\",ALL_A!C259)","v":""},{"$f":"IF(ALL_A!G259=\"\",\"\",ALL_A!G259)","v":""},{"$f":"IF(ALL_A!H259=\"\",\"\",ALL_A!H259)","v":""},null,null,null,null,null,null,null,null,null,null,null,null,null,null,null,null,null,null,"","",""]
[1,null,{"$f":"IF(ALL_A!C260=\"\",\"\",ALL_A!C260)","v":""},{"$f":"IF(ALL_A!G260=\"\",\"\",ALL_A!G260)","v":""},{"$f":"IF(ALL_A!H260=\"\",\"\",ALL_A!H260)","v":""},null,null,null,null,null,null,null,null,null,null,null,null,null,null,null,null,null,null,"","",""]
[1,null,{"$f":"IF(ALL_A!C261=\"\",\"\",ALL_A!C261)","v":""},{"$f":"IF(ALL_A!G261=\"\",\"\",ALL_A!G261)","v":""},{"$f":"IF(ALL_A!H261=\"\",\"\",ALL_A!H261)","v":""},null,null,null,null,null,null,null,null,null,null,null,null,null,null,null,null,null,null,"","",""]
[1,null,{"$f":"IF(ALL_A!C262=\"\",\"\",ALL_A!C262)","v":""},{"$f":"IF(ALL_A!G262=\"\",\"\",ALL_A!G262)","v":""},{"$f":"IF(ALL_A!H262=\"\",\"\",ALL_A!H262)","v":""},null,null,null,null,null,null,null,null,null,null,null,null,null,null,null,null,null,null,"","",""]
[1,null,{"$f":"IF(ALL_A!C263=\"\",\"\",ALL_A!C263)","v":""},{"$f":"IF(ALL_A!G263=\"\",\"\",ALL_A!G263)","v":""},{"$f":"IF(ALL_A!H263=\"\",\"\",ALL_A!H263)","v":""},null,null,null,null,null,null,null,null,null,null,null,null,null,null,null,null,null,null,"","",""]
[1,null,{"$f":"IF(ALL_A!C264=\"\",\"\",ALL_A!C264)","v":""},{"$f":"IF(ALL_A!G264=\"\",\"\",ALL_A!G264)","v":""},{"$f":"IF(ALL_A!H264=\"\",\"\",ALL_A!H264)","v":""},null,null,null,null,null,null,null,null,null,null,null,null,null,null,null,null,null,null,"","",""]
[1,null,{"$f":"IF(ALL_A!C265=\"\",\"\",ALL_A!C265)","v":""},{"$f":"IF(ALL_A!G265=\"\",\"\",ALL_A!G265)","v":""},{"$f":"IF(ALL_A!H265=\"\",\"\",ALL_A!H265)","v":""},null,null,null,null,null,null,null,null,null,null,null,null,null,null,null,null,null,null,"","",""]
[1,null,{"$f":"IF(ALL_A!C266=\"\",\"\",ALL_A!C266)","v":""},{"$f":"IF(ALL_A!G266=\"\",\"\",ALL_A!G266)","v":""},{"$f":"IF(ALL_A!H266=\"\",\"\",ALL_A!H266)","v":""},null,null,null,null,null,null,null,null,null,null,null,null,null,null,null,null,null,null,"","",""]
[1,null,{"$f":"IF(ALL_A!C267=\"\",\"\",ALL_A!C267)","v":""},{"$f":"IF(ALL_A!G267=\"\",\"\",ALL_A!G267)","v":""},{"$f":"IF(ALL_A!H267=\"\",\"\",ALL_A!H267)","v":""},null,null,null,null,null,null,null,null,null,null,null,null,null,null,null,null,null,null,"","",""]
[1,null,{"$f":"IF(ALL_A!C268=\"\",\"\",ALL_A!C268)","v":""},{"$f":"IF(ALL_A!G268=\"\",\"\",ALL_A!G268)","v":""},{"$f":"IF(ALL_A!H268=\"\",\"\",ALL_A!H268)","v":""},null,null,null,null,null,null,null,null,null,null,null,null,null,null,null,null,null,null,"","",""]
[1,null,{"$f":"IF(ALL_A!C269=\"\",\"\",ALL_A!C269)","v":""},{"$f":"IF(ALL_A!G269=\"\",\"\",ALL_A!G269)","v":""},{"$f":"IF(ALL_A!H269=\"\",\"\",ALL_A!H269)","v":""},null,null,null,null,null,null,null,null,null,null,null,null,null,null,null,null,null,null,"","",""]
[1,null,{"$f":"IF(ALL_A!C270=\"\",\"\",ALL_A!C270)","v":""},{"$f":"IF(ALL_A!G270=\"\",\"\",ALL_A!G270)","v":""},{"$f":"IF(ALL_A!H270=\"\",\"\",ALL_A!H270)","v":""},null,null,null,null,null,null,null,null,null,null,null,null,null,null,null,null,null,null,"","",""]
[1,null,{"$f":"IF(ALL_A!C271=\"\",\"\",ALL_A!C271)","v":""},{"$f":"IF(ALL_A!G271=\"\",\"\",ALL_A!G271)","v":""},{"$f":"IF(ALL_A!H271=\"\",\"\",ALL_A!H271)","v":""},null,null,null,null,null,null,null,null,null,null,null,null,null,null,null,null,null,null,"","",""]
[1,null,{"$f":"IF(ALL_A!C272=\"\",\"\",ALL_A!C272)","v":""},{"$f":"IF(ALL_A!G272=\"\",\"\",ALL_A!G272)","v":""},{"$f":"IF(ALL_A!H272=\"\",\"\",ALL_A!H272)","v":""},null,null,null,null,null,null,null,null,null,null,null,null,null,null,null,null,null,null,"","",""]
[1,null,{"$f":"IF(ALL_A!C273=\"\",\"\",ALL_A!C273)","v":""},{"$f":"IF(ALL_A!G273=\"\",\"\",ALL_A!G273)","v":""},{"$f":"IF(ALL_A!H273=\"\",\"\",ALL_A!H273)","v":""},null,null,null,null,null,null,null,null,null,null,null,null,null,null,null,null,null,null,"","",""]
[1,null,{"$f":"IF(ALL_A!C274=\"\",\"\",ALL_A!C274)","v":""},{"$f":"IF(ALL_A!G274=\"\",\"\",ALL_A!G274)","v":""},{"$f":"IF(ALL_A!H274=\"\",\"\",ALL_A!H274)","v":""},null,null,null,null,null,null,null,null,null,null,null,null,null,null,null,null,null,null,"","",""]
[1,null,{"$f":"IF(ALL_A!C275=\"\",\"\",ALL_A!C275)","v":""},{"$f":"IF(ALL_A!G275=\"\",\"\",ALL_A!G275)","v":""},{"$f":"IF(ALL_A!H275=\"\",\"\",ALL_A!H275)","v":""},null,null,null,null,null,null,null,null,null,null,null,null,null,null,null,null,null,null,"","",""]
[1,null,{"$f":"IF(ALL_A!C276=\"\",\"\",ALL_A!C276)","v":""},{"$f":"IF(ALL_A!G276=\"\",\"\",ALL_A!G276)","v":""},{"$f":"IF(ALL_A!H276=\"\",\"\",ALL_A!H276)","v":""},null,null,null,null,null,null,null,null,null,null,null,null,null,null,null,null,null,null,"","",""]
[1,null,{"$f":"IF(ALL_A!C277=\"\",\"\",ALL_A!C277)","v":""},{"$f":"IF(ALL_A!G277=\"\",\"\",ALL_A!G277)","v":""},{"$f":"IF(ALL_A!H277=\"\",\"\",ALL_A!H277)","v":""},null,null,null,null,null,null,null,null,null,null,null,null,null,null,null,null,null,null,"","",""]
[1,null,{"$f":"IF(ALL_A!C278=\"\",\"\",ALL_A!C278)","v":""},{"$f":"IF(ALL_A!G278=\"\",\"\",ALL_A!G278)","v":""},{"$f":"IF(ALL_A!H278=\"\",\"\",ALL_A!H278)","v":""},null,null,null,null,null,null,null,null,null,null,null,null,null,null,null,null,null,null,"","",""]
[1,null,{"$f":"IF(ALL_A!C279=\"\",\"\",ALL_A!C279)","v":""},{"$f":"IF(ALL_A!G279=\"\",\"\",ALL_A!G279)","v":""},{"$f":"IF(ALL_A!H279=\"\",\"\",ALL_A!H279)","v":""},null,null,null,null,null,null,null,null,null,null,null,null,null,null,null,null,null,null,"","",""]
[1,null,{"$f":"IF(ALL_A!C280=\"\",\"\",ALL_A!C280)","v":""},{"$f":"IF(ALL_A!G280=\"\",\"\",ALL_A!G280)","v":""},{"$f":"IF(ALL_A!H280=\"\",\"\",ALL_A!H280)","v":""},null,null,null,null,null,null,null,null,null,null,null,null,null,null,null,null,null,null,"","",""]
[1,null,{"$f":"IF(ALL_A!C281=\"\",\"\",ALL_A!C281)","v":""},{"$f":"IF(ALL_A!G281=\"\",\"\",ALL_A!G281)","v":""},{"$f":"IF(ALL_A!H281=\"\",\"\",ALL_A!H281)","v":""},null,null,null,null,null,null,null,null,null,null,null,null,null,null,null,null,null,null,"","",""]
[1,null,{"$f":"IF(ALL_A!C282=\"\",\"\",ALL_A!C282)","v":""},{"$f":"IF(ALL_A!G282=\"\",\"\",ALL_A!G282)","v":""},{"$f":"IF(ALL_A!H282=\"\",\"\",ALL_A!H282)","v":""},null,null,null,null,null,null,null,null,null,null,null,null,null,null,null,null,null,null,"","",""]
[1,null,{"$f":"IF(ALL_A!C283=\"\",\"\",ALL_A!C283)","v":""},{"$f":"IF(ALL_A!G283=\"\",\"\",ALL_A!G283)","v":""},{"$f":"IF(ALL_A!H283=\"\",\"\",ALL_A!H283)","v":""},null,null,null,null,null,null,null,null,null,null,null,null,null,null,null,null,null,null,"","",""]
[1,null,{"$f":"IF(ALL_A!C284=\"\",\"\",ALL_A!C284)","v":""},{"$f":"IF(ALL_A!G284=\"\",\"\",ALL_A!G284)","v":""},{"$f":"IF(ALL_A!H284=\"\",\"\",ALL_A!H284)","v":""},null,null,null,null,null,null,null,null,null,null,null,null,null,null,null,null,null,null,"","",""]
[1,null,{"$f":"IF(ALL_A!C285=\"\",\"\",ALL_A!C285)","v":""},{"$f":"IF(ALL_A!G285=\"\",\"\",ALL_A!G285)","v":""},{"$f":"IF(ALL_A!H285=\"\",\"\",ALL_A!H285)","v":""},null,null,null,null,null,null,null,null,null,null,null,null,null,null,null,null,null,null,"","",""]
[1,null,{"$f":"IF(ALL_A!C286=\"\",\"\",ALL_A!C286)","v":""},{"$f":"IF(ALL_A!G286=\"\",\"\",ALL_A!G286)","v":""},{"$f":"IF(ALL_A!H286=\"\",\"\",ALL_A!H286)","v":""},null,null,null,null,null,null,null,null,null,null,null,null,null,null,null,null,null,null,"","",""]
[1,null,{"$f":"IF(ALL_A!C287=\"\",\"\",ALL_A!C287)","v":""},{"$f":"IF(ALL_A!G287=\"\",\"\",ALL_A!G287)","v":""},{"$f":"IF(ALL_A!H287=\"\",\"\",ALL_A!H287)","v":""},null,null,null,null,null,null,null,null,null,null,null,null,null,null,null,null,null,null,"","",""]
[1,null,{"$f":"IF(ALL_A!C288=\"\",\"\",ALL_A!C288)","v":""},{"$f":"IF(ALL_A!G288=\"\",\"\",ALL_A!G288)","v":""},{"$f":"IF(ALL_A!H288=\"\",\"\",ALL_A!H288)","v":""},null,null,null,null,null,null,null,null,null,null,null,null,null,null,null,null,null,null,"","",""]
[1,null,{"$f":"IF(ALL_A!C289=\"\",\"\",ALL_A!C289)","v":""},{"$f":"IF(ALL_A!G289=\"\",\"\",ALL_A!G289)","v":""},{"$f":"IF(ALL_A!H289=\"\",\"\",ALL_A!H289)","v":""},null,null,null,null,null,null,null,null,null,null,null,null,null,null,null,null,null,null,"","",""]
[1,null,{"$f":"IF(ALL_A!C290=\"\",\"\",ALL_A!C290)","v":""},{"$f":"IF(ALL_A!G290=\"\",\"\",ALL_A!G290)","v":""},{"$f":"IF(ALL_A!H290=\"\",\"\",ALL_A!H290)","v":""},null,null,null,null,null,null,null,null,null,null,null,null,null,null,null,null,null,null,"","",""]
[1,null,{"$f":"IF(ALL_A!C291=\"\",\"\",ALL_A!C291)","v":""},{"$f":"IF(ALL_A!G291=\"\",\"\",ALL_A!G291)","v":""},{"$f":"IF(ALL_A!H291=\"\",\"\",ALL_A!H291)","v":""},null,null,null,null,null,null,null,null,null,null,null,null,null,null,null,null,null,null,{"$f":"IFERROR(C67,\"#ERR\")","v":""},{"$f":"IFERROR(D67,\"#ERR\")","v":""},{"$f":"IFERROR(E67,\"#ERR\")","v":""}]
[1,null,{"$f":"IF(ALL_A!C292=\"\",\"\",ALL_A!C292)","v":""},{"$f":"IF(ALL_A!G292=\"\",\"\",ALL_A!G292)","v":""},{"$f":"IF(ALL_A!H292=\"\",\"\",ALL_A!H292)","v":""},null,null,null,null,null,null,null,null,null,null,null,null,null,null,null,null,null,null,"","",""]
[1,null,{"$f":"IF(ALL_A!C293=\"\",\"\",ALL_A!C293)","v":""},{"$f":"IF(ALL_A!G293=\"\",\"\",ALL_A!G293)","v":""},{"$f":"IF(ALL_A!H293=\"\",\"\",ALL_A!H293)","v":""},null,null,null,null,null,null,null,null,null,null,null,null,null,null,null,null,null,null,"","",""]
[1,null,{"$f":"IF(ALL_A!C294=\"\",\"\",ALL_A!C294)","v":""},{"$f":"IF(ALL_A!G294=\"\",\"\",ALL_A!G294)","v":""},{"$f":"IF(ALL_A!H294=\"\",\"\",ALL_A!H294)","v":""},null,null,null,null,null,null,null,null,null,null,null,null,null,null,null,null,null,null,"","",""]
[1,null,{"$f":"IF(ALL_A!C295=\"\",\"\",ALL_A!C295)","v":""},{"$f":"IF(ALL_A!G295=\"\",\"\",ALL_A!G295)","v":""},{"$f":"IF(ALL_A!H295=\"\",\"\",ALL_A!H295)","v":""},null,null,null,null,null,null,null,null,null,null,null,null,null,null,null,null,null,null,"","",""]
[1,null,{"$f":"IF(ALL_A!C296=\"\",\"\",ALL_A!C296)","v":""},{"$f":"IF(ALL_A!G296=\"\",\"\",ALL_A!G296)","v":""},{"$f":"IF(ALL_A!H296=\"\",\"\",ALL_A!H296)","v":""},null,null,null,null,null,null,null,null,null,null,null,null,null,null,null,null,null,null,"","",""]
[1,null,{"$f":"IF(ALL_A!C297=\"\",\"\",ALL_A!C297)","v":""},{"$f":"IF(ALL_A!G297=\"\",\"\",ALL_A!G297)","v":""},{"$f":"IF(ALL_A!H297=\"\",\"\",ALL_A!H297)","v":""},null,null,null,null,null,null,null,null,null,null,null,null,null,null,null,null,null,null,"","",""]
[1,null,{"$f":"IF(ALL_A!C298=\"\",\"\",ALL_A!C298)","v":""},{"$f":"IF(ALL_A!G298=\"\",\"\",ALL_A!G298)","v":""},{"$f":"IF(ALL_A!H298=\"\",\"\",ALL_A!H298)","v":""},null,null,null,null,null,null,null,null,null,null,null,null,null,null,null,null,null,null,"","",""]
[1,null,{"$f":"IF(ALL_A!C299=\"\",\"\",ALL_A!C299)","v":""},{"$f":"IF(ALL_A!G299=\"\",\"\",ALL_A!G299)","v":""},{"$f":"IF(ALL_A!H299=\"\",\"\",ALL_A!H299)","v":""},null,null,null,null,null,null,null,null,null,null,null,null,null,null,null,null,null,null,"","",""]
[1,null,{"$f":"IF(ALL_A!C300=\"\",\"\",ALL_A!C300)","v":""},{"$f":"IF(ALL_A!G300=\"\",\"\",ALL_A!G300)","v":""},{"$f":"IF(ALL_A!H300=\"\",\"\",ALL_A!H300)","v":""},null,null,null,null,null,null,null,null,null,null,null,null,null,null,null,null,null,null,"","",""]
[1,null,{"$f":"IF(ALL_A!C301=\"\",\"\",ALL_A!C301)","v":""},{"$f":"IF(ALL_A!G301=\"\",\"\",ALL_A!G301)","v":""},{"$f":"IF(ALL_A!H301=\"\",\"\",ALL_A!H301)","v":""},null,null,null,null,null,null,null,null,null,null,null,null,null,null,null,null,null,null,"","",""]
[1,null,{"$f":"IF(ALL_A!C302=\"\",\"\",ALL_A!C302)","v":""},{"$f":"IF(ALL_A!G302=\"\",\"\",ALL_A!G302)","v":""},{"$f":"IF(ALL_A!H302=\"\",\"\",ALL_A!H302)","v":""},null,null,null,null,null,null,null,null,null,null,null,null,null,null,null,null,null,null,"","",""]
[1,null,{"$f":"IF(ALL_A!C303=\"\",\"\",ALL_A!C303)","v":""},{"$f":"IF(ALL_A!G303=\"\",\"\",ALL_A!G303)","v":""},{"$f":"IF(ALL_A!H303=\"\",\"\",ALL_A!H303)","v":""},null,null,null,null,null,null,null,null,null,null,null,null,null,null,null,null,null,null,"","",""]
[1,null,{"$f":"IF(ALL_A!C304=\"\",\"\",ALL_A!C304)","v":""},{"$f":"IF(ALL_A!G304=\"\",\"\",ALL_A!G304)","v":""},{"$f":"IF(ALL_A!H304=\"\",\"\",ALL_A!H304)","v":""},null,null,null,null,null,null,null,null,null,null,null,null,null,null,null,null,null,null,"","",""]
[1,null,{"$f":"IF(ALL_A!C305=\"\",\"\",ALL_A!C305)","v":""},{"$f":"IF(ALL_A!G305=\"\",\"\",ALL_A!G305)","v":""},{"$f":"IF(ALL_A!H305=\"\",\"\",ALL_A!H305)","v":""},null,null,null,null,null,null,null,null,null,null,null,null,null,null,null,null,null,null,"","",""]
[1,null,{"$f":"IF(ALL_A!C306=\"\",\"\",ALL_A!C306)","v":""},{"$f":"IF(ALL_A!G306=\"\",\"\",ALL_A!G306)","v":""},{"$f":"IF(ALL_A!H306=\"\",\"\",ALL_A!H306)","v":""},null,null,null,null,null,null,null,null,null,null,null,null,null,null,null,null,null,null,"","",""]
[1,null,{"$f":"IF(ALL_A!C307=\"\",\"\",ALL_A!C307)","v":""},{"$f":"IF(ALL_A!G307=\"\",\"\",ALL_A!G307)","v":""},{"$f":"IF(ALL_A!H307=\"\",\"\",ALL_A!H307)","v":""},null,null,null,null,null,null,null,null,null,null,null,null,null,null,null,null,null,null,"","",""]
[1,null,{"$f":"IF(ALL_A!C308=\"\",\"\",ALL_A!C308)","v":""},{"$f":"IF(ALL_A!G308=\"\",\"\",ALL_A!G308)","v":""},{"$f":"IF(ALL_A!H308=\"\",\"\",ALL_A!H308)","v":""},null,null,null,null,null,null,null,null,null,null,null,null,null,null,null,null,null,null,"","",""]
[1,null,{"$f":"IF(ALL_A!C309=\"\",\"\",ALL_A!C309)","v":""},{"$f":"IF(ALL_A!G309=\"\",\"\",ALL_A!G309)","v":""},{"$f":"IF(ALL_A!H309=\"\",\"\",ALL_A!H309)","v":""},null,null,null,null,null,null,null,null,null,null,null,null,null,null,null,null,null,null,"","",""]
[1,null,{"$f":"IF(ALL_A!C310=\"\",\"\",ALL_A!C310)","v":""},{"$f":"IF(ALL_A!G310=\"\",\"\",ALL_A!G310)","v":""},{"$f":"IF(ALL_A!H310=\"\",\"\",ALL_A!H310)","v":""},null,null,null,null,null,null,null,null,null,null,null,null,null,null,null,null,null,null,"","",""]
[1,null,{"$f":"IF(ALL_A!C311=\"\",\"\",ALL_A!C311)","v":""},{"$f":"IF(ALL_A!G311=\"\",\"\",ALL_A!G311)","v":""},{"$f":"IF(ALL_A!H311=\"\",\"\",ALL_A!H311)","v":""},null,null,null,null,null,null,null,null,null,null,null,null,null,null,null,null,null,null,"","",""]
[1,null,{"$f":"IF(ALL_A!C312=\"\",\"\",ALL_A!C312)","v":""},{"$f":"IF(ALL_A!G312=\"\",\"\",ALL_A!G312)","v":""},{"$f":"IF(ALL_A!H312=\"\",\"\",ALL_A!H312)","v":""},null,null,null,null,null,null,null,null,null,null,null,null,null,null,null,null,null,null,"","",""]
[1,null,{"$f":"IF(ALL_A!C313=\"\",\"\",ALL_A!C313)","v":""},{"$f":"IF(ALL_A!G313=\"\",\"\",ALL_A!G313)","v":""},{"$f":"IF(ALL_A!H313=\"\",\"\",ALL_A!H313)","v":""},null,null,null,null,null,null,null,null,null,null,null,null,null,null,null,null,null,null,"","",""]
[1,null,{"$f":"IF(ALL_A!C314=\"\",\"\",ALL_A!C314)","v":""},{"$f":"IF(ALL_A!G314=\"\",\"\",ALL_A!G314)","v":""},{"$f":"IF(ALL_A!H314=\"\",\"\",ALL_A!H314)","v":""},null,null,null,null,null,null,null,null,null,null,null,null,null,null,null,null,null,null,"","",""]
[1,null,{"$f":"IF(ALL_A!C315=\"\",\"\",ALL_A!C315)","v":""},{"$f":"IF(ALL_A!G315=\"\",\"\",ALL_A!G315)","v":""},{"$f":"IF(ALL_A!H315=\"\",\"\",ALL_A!H315)","v":""},null,null,null,null,null,null,null,null,null,null,null,null,null,null,null,null,null,null,"","",""]
[1,null,{"$f":"IF(ALL_A!C316=\"\",\"\",ALL_A!C316)","v":""},{"$f":"IF(ALL_A!G316=\"\",\"\",ALL_A!G316)","v":""},{"$f":"IF(ALL_A!H316=\"\",\"\",ALL_A!H316)","v":""},null,null,null,null,null,null,null,null,null,null,null,null,null,null,null,null,null,null,"","",""]
[1,null,{"$f":"IF(ALL_A!C317=\"\",\"\",ALL_A!C317)","v":""},{"$f":"IF(ALL_A!G317=\"\",\"\",ALL_A!G317)","v":""},{"$f":"IF(ALL_A!H317=\"\",\"\",ALL_A!H317)","v":""},null,null,null,null,null,null,null,null,null,null,null,null,null,null,null,null,null,null,"","",""]
[1,null,{"$f":"IF(ALL_A!C318=\"\",\"\",ALL_A!C318)","v":""},{"$f":"IF(ALL_A!G318=\"\",\"\",ALL_A!G318)","v":""},{"$f":"IF(ALL_A!H318=\"\",\"\",ALL_A!H318)","v":""},null,null,null,null,null,null,null,null,null,null,null,null,null,null,null,null,null,null,"","",""]
[1,null,{"$f":"IF(ALL_A!C319=\"\",\"\",ALL_A!C319)","v":""},{"$f":"IF(ALL_A!G319=\"\",\"\",ALL_A!G319)","v":""},{"$f":"IF(ALL_A!H319=\"\",\"\",ALL_A!H319)","v":""},null,null,null,null,null,null,null,null,null,null,null,null,null,null,null,null,null,null,"","",""]
[1,null,{"$f":"IF(ALL_A!C320=\"\",\"\",ALL_A!C320)","v":""},{"$f":"IF(ALL_A!G320=\"\",\"\",ALL_A!G320)","v":""},{"$f":"IF(ALL_A!H320=\"\",\"\",ALL_A!H320)","v":""},null,null,null,null,null,null,null,null,null,null,null,null,null,null,null,null,null,null,"","",""]
[1,null,{"$f":"IF(ALL_A!C321=\"\",\"\",ALL_A!C321)","v":""},{"$f":"IF(ALL_A!G321=\"\",\"\",ALL_A!G321)","v":""},{"$f":"IF(ALL_A!H321=\"\",\"\",ALL_A!H321)","v":""},null,null,null,null,null,null,null,null,null,null,null,null,null,null,null,null,null,null,"","",""]
[1,null,{"$f":"IF(ALL_A!C322=\"\",\"\",ALL_A!C322)","v":""},{"$f":"IF(ALL_A!G322=\"\",\"\",ALL_A!G322)","v":""},{"$f":"IF(ALL_A!H322=\"\",\"\",ALL_A!H322)","v":""},null,null,null,null,null,null,null,null,null,null,null,null,null,null,null,null,null,null,"","",""]
[1,null,{"$f":"IF(ALL_A!C323=\"\",\"\",ALL_A!C323)","v":""},{"$f":"IF(ALL_A!G323=\"\",\"\",ALL_A!G323)","v":""},{"$f":"IF(ALL_A!H323=\"\",\"\",ALL_A!H323)","v":""},null,null,null,null,null,null,null,null,null,null,null,null,null,null,null,null,null,null,"","",""]
[1,null,{"$f":"IF(ALL_A!C324=\"\",\"\",ALL_A!C324)","v":""},{"$f":"IF(ALL_A!G324=\"\",\"\",ALL_A!G324)","v":""},{"$f":"IF(ALL_A!H324=\"\",\"\",ALL_A!H324)","v":""},null,null,null,null,null,null,null,null,null,null,null,null,null,null,null,null,null,null,"","",""]
[1,null,{"$f":"IF(ALL_A!C325=\"\",\"\",ALL_A!C325)","v":""},{"$f":"IF(ALL_A!G325=\"\",\"\",ALL_A!G325)","v":""},{"$f":"IF(ALL_A!H325=\"\",\"\",ALL_A!H325)","v":""},null,null,null,null,null,null,null,null,null,null,null,null,null,null,null,null,null,null,"","",""]
[1,null,{"$f":"IF(ALL_A!C326=\"\",\"\",ALL_A!C326)","v":""},{"$f":"IF(ALL_A!G326=\"\",\"\",ALL_A!G326)","v":""},{"$f":"IF(ALL_A!H326=\"\",\"\",ALL_A!H326)","v":""},null,null,null,null,null,null,null,null,null,null,null,null,null,null,null,null,null,null,"","",""]
[1,null,{"$f":"IF(ALL_A!C327=\"\",\"\",ALL_A!C327)","v":""},{"$f":"IF(ALL_A!G327=\"\",\"\",ALL_A!G327)","v":""},{"$f":"IF(ALL_A!H327=\"\",\"\",ALL_A!H327)","v":""},null,null,null,null,null,null,null,null,null,null,null,null,null,null,null,null,null,null,"","",""]
[1,null,{"$f":"IF(ALL_A!C328=\"\",\"\",ALL_A!C328)","v":""},{"$f":"IF(ALL_A!G328=\"\",\"\",ALL_A!G328)","v":""},{"$f":"IF(ALL_A!H328=\"\",\"\",ALL_A!H328)","v":""},null,null,null,null,null,null,null,null,null,null,null,null,null,null,null,null,null,null,"","",""]
[1,null,{"$f":"IF(ALL_A!C329=\"\",\"\",ALL_A!C329)","v":""},{"$f":"IF(ALL_A!G329=\"\",\"\",ALL_A!G329)","v":""},{"$f":"IF(ALL_A!H329=\"\",\"\",ALL_A!H329)","v":""},null,null,null,null,null,null,null,null,null,null,null,null,null,null,null,null,null,null,"","",""]
[1,null,{"$f":"IF(ALL_A!C330=\"\",\"\",ALL_A!C330)","v":""},{"$f":"IF(ALL_A!G330=\"\",\"\",ALL_A!G330)","v":""},{"$f":"IF(ALL_A!H330=\"\",\"\",ALL_A!H330)","v":""},null,null,null,null,null,null,null,null,null,null,null,null,null,null,null,null,null,null,"","",""]
[1,null,{"$f":"IF(ALL_A!C331=\"\",\"\",ALL_A!C331)","v":""},{"$f":"IF(ALL_A!G331=\"\",\"\",ALL_A!G331)","v":""},{"$f":"IF(ALL_A!H331=\"\",\"\",ALL_A!H331)","v":""},null,null,null,null,null,null,null,null,null,null,null,null,null,null,null,null,null,null,"","",""]
[1,null,{"$f":"IF(ALL_A!C332=\"\",\"\",ALL_A!C332)","v":""},{"$f":"IF(ALL_A!G332=\"\",\"\",ALL_A!G332)","v":""},{"$f":"IF(ALL_A!H332=\"\",\"\",ALL_A!H332)","v":""},null,null,null,null,null,null,null,null,null,null,null,null,null,null,null,null,null,null,"","",""]
[1,null,{"$f":"IF(ALL_A!C333=\"\",\"\",ALL_A!C333)","v":""},{"$f":"IF(ALL_A!G333=\"\",\"\",ALL_A!G333)","v":""},{"$f":"IF(ALL_A!H333=\"\",\"\",ALL_A!H333)","v":""},null,null,null,null,null,null,null,null,null,null,null,null,null,null,null,null,null,null,"","",""]
[1,null,{"$f":"IF(ALL_A!C334=\"\",\"\",ALL_A!C334)","v":""},{"$f":"IF(ALL_A!G334=\"\",\"\",ALL_A!G334)","v":""},{"$f":"IF(ALL_A!H334=\"\",\"\",ALL_A!H334)","v":""},null,null,null,null,null,null,null,null,null,null,null,null,null,null,null,null,null,null,"","",""]
[1,null,{"$f":"IF(ALL_A!C335=\"\",\"\",ALL_A!C335)","v":""},{"$f":"IF(ALL_A!G335=\"\",\"\",ALL_A!G335)","v":""},{"$f":"IF(ALL_A!H335=\"\",\"\",ALL_A!H335)","v":""},null,null,null,null,null,null,null,null,null,null,null,null,null,null,null,null,null,null,"","",""]
[1,null,{"$f":"IF(ALL_A!C336=\"\",\"\",ALL_A!C336)","v":""},{"$f":"IF(ALL_A!G336=\"\",\"\",ALL_A!G336)","v":""},{"$f":"IF(ALL_A!H336=\"\",\"\",ALL_A!H336)","v":""},null,null,null,null,null,null,null,null,null,null,null,null,null,null,null,null,null,null,"","",""]
[1,null,{"$f":"IF(ALL_A!C337=\"\",\"\",ALL_A!C337)","v":""},{"$f":"IF(ALL_A!G337=\"\",\"\",ALL_A!G337)","v":""},{"$f":"IF(ALL_A!H337=\"\",\"\",ALL_A!H337)","v":""},null,null,null,null,null,null,null,null,null,null,null,null,null,null,null,null,null,null,"","",""]
[1,null,{"$f":"IF(ALL_A!C338=\"\",\"\",ALL_A!C338)","v":""},{"$f":"IF(ALL_A!G338=\"\",\"\",ALL_A!G338)","v":""},{"$f":"IF(ALL_A!H338=\"\",\"\",ALL_A!H338)","v":""},null,null,null,null,null,null,null,null,null,null,null,null,null,null,null,null,null,null,"","",""]
[1,null,{"$f":"IF(ALL_A!C339=\"\",\"\",ALL_A!C339)","v":""},{"$f":"IF(ALL_A!G339=\"\",\"\",ALL_A!G339)","v":""},{"$f":"IF(ALL_A!H339=\"\",\"\",ALL_A!H339)","v":""},null,null,null,null,null,null,null,null,null,null,null,null,null,null,null,null,null,null,"","",""]
[1,null,{"$f":"IF(ALL_A!C340=\"\",\"\",ALL_A!C340)","v":""},{"$f":"IF(ALL_A!G340=\"\",\"\",ALL_A!G340)","v":""},{"$f":"IF(ALL_A!H340=\"\",\"\",ALL_A!H340)","v":""},null,null,null,null,null,null,null,null,null,null,null,null,null,null,null,null,null,null,"","",""]
[1,null,{"$f":"IF(ALL_A!C341=\"\",\"\",ALL_A!C341)","v":""},{"$f":"IF(ALL_A!G341=\"\",\"\",ALL_A!G341)","v":""},{"$f":"IF(ALL_A!H341=\"\",\"\",ALL_A!H341)","v":""},null,null,null,null,null,null,null,null,null,null,null,null,null,null,null,null,null,null,"","",""]
[1,null,{"$f":"IF(ALL_A!C342=\"\",\"\",ALL_A!C342)","v":""},{"$f":"IF(ALL_A!G342=\"\",\"\",ALL_A!G342)","v":""},{"$f":"IF(ALL_A!H342=\"\",\"\",ALL_A!H342)","v":""},null,null,null,null,null,null,null,null,null,null,null,null,null,null,null,null,null,null,"","",""]
[1,null,{"$f":"IF(ALL_A!C343=\"\",\"\",ALL_A!C343)","v":""},{"$f":"IF(ALL_A!G343=\"\",\"\",ALL_A!G343)","v":""},{"$f":"IF(ALL_A!H343=\"\",\"\",ALL_A!H343)","v":""},null,null,null,null,null,null,null,null,null,null,null,null,null,null,null,null,null,null,"","",""]
[1,null,{"$f":"IF(ALL_A!C344=\"\",\"\",ALL_A!C344)","v":""},{"$f":"IF(ALL_A!G344=\"\",\"\",ALL_A!G344)","v":""},{"$f":"IF(ALL_A!H344=\"\",\"\",ALL_A!H344)","v":""},null,null,null,null,null,null,null,null,null,null,null,null,null,null,null,null,null,null,"","",""]
[1,null,{"$f":"IF(ALL_A!C345=\"\",\"\",ALL_A!C345)","v":""},{"$f":"IF(ALL_A!G345=\"\",\"\",ALL_A!G345)","v":""},{"$f":"IF(ALL_A!H345=\"\",\"\",ALL_A!H345)","v":""},null,null,null,null,null,null,null,null,null,null,null,null,null,null,null,null,null,null,"","",""]
[1,null,{"$f":"IF(ALL_A!C346=\"\",\"\",ALL_A!C346)","v":""},{"$f":"IF(ALL_A!G346=\"\",\"\",ALL_A!G346)","v":""},{"$f":"IF(ALL_A!H346=\"\",\"\",ALL_A!H346)","v":""},null,null,null,null,null,null,null,null,null,null,null,null,null,null,null,null,null,null,"","",""]
[1,null,{"$f":"IF(ALL_A!C347=\"\",\"\",ALL_A!C347)","v":""},{"$f":"IF(ALL_A!G347=\"\",\"\",ALL_A!G347)","v":""},{"$f":"IF(ALL_A!H347=\"\",\"\",ALL_A!H347)","v":""},null,null,null,null,null,null,null,null,null,null,null,null,null,null,null,null,null,null,"","",""]
[1,null,{"$f":"IF(ALL_A!C348=\"\",\"\",ALL_A!C348)","v":""},{"$f":"IF(ALL_A!G348=\"\",\"\",ALL_A!G348)","v":""},{"$f":"IF(ALL_A!H348=\"\",\"\",ALL_A!H348)","v":""},null,null,null,null,null,null,null,null,null,null,null,null,null,null,null,null,null,null,"","",""]
[1,null,{"$f":"IF(ALL_A!C349=\"\",\"\",ALL_A!C349)","v":""},{"$f":"IF(ALL_A!G349=\"\",\"\",ALL_A!G349)","v":""},{"$f":"IF(ALL_A!H349=\"\",\"\",ALL_A!H349)","v":""},null,null,null,null,null,null,null,null,null,null,null,null,null,null,null,null,null,null,"","",""]
[1,null,{"$f":"IF(ALL_A!C350=\"\",\"\",ALL_A!C350)","v":""},{"$f":"IF(ALL_A!G350=\"\",\"\",ALL_A!G350)","v":""},{"$f":"IF(ALL_A!H350=\"\",\"\",ALL_A!H350)","v":""},null,null,null,null,null,null,null,null,null,null,null,null,null,null,null,null,null,null,"","",""]
[1,null,{"$f":"IF(ALL_A!C351=\"\",\"\",ALL_A!C351)","v":""},{"$f":"IF(ALL_A!G351=\"\",\"\",ALL_A!G351)","v":""},{"$f":"IF(ALL_A!H351=\"\",\"\",ALL_A!H351)","v":""},null,null,null,null,null,null,null,null,null,null,null,null,null,null,null,null,null,null,"","",""]
[1,null,{"$f":"IF(ALL_A!C352=\"\",\"\",ALL_A!C352)","v":""},{"$f":"IF(ALL_A!G352=\"\",\"\",ALL_A!G352)","v":""},{"$f":"IF(ALL_A!H352=\"\",\"\",ALL_A!H352)","v":""},null,null,null,null,null,null,null,null,null,null,null,null,null,null,null,null,null,null,"","",""]
[1,null,{"$f":"IF(ALL_A!C353=\"\",\"\",ALL_A!C353)","v":""},{"$f":"IF(ALL_A!G353=\"\",\"\",ALL_A!G353)","v":""},{"$f":"IF(ALL_A!H353=\"\",\"\",ALL_A!H353)","v":""},null,null,null,null,null,null,null,null,null,null,null,null,null,null,null,null,null,null,"","",""]
[1,null,{"$f":"IF(ALL_A!C354=\"\",\"\",ALL_A!C354)","v":""},{"$f":"IF(ALL_A!G354=\"\",\"\",ALL_A!G354)","v":""},{"$f":"IF(ALL_A!H354=\"\",\"\",ALL_A!H354)","v":""},null,null,null,null,null,null,null,null,null,null,null,null,null,null,null,null,null,null,"","",""]
[1,null,{"$f":"IF(ALL_A!C355=\"\",\"\",ALL_A!C355)","v":""},{"$f":"IF(ALL_A!G355=\"\",\"\",ALL_A!G355)","v":""},{"$f":"IF(ALL_A!H355=\"\",\"\",ALL_A!H355)","v":""},null,null,null,null,null,null,null,null,null,null,null,null,null,null,null,null,null,null,{"$f":"IFERROR(C131,\"#ERR\")","v":""},{"$f":"IFERROR(D131,\"#ERR\")","v":""},{"$f":"IFERROR(E131,\"#ERR\")","v":""}]
[1,null,{"$f":"IF(ALL_A!C356=\"\",\"\",ALL_A!C356)","v":""},{"$f":"IF(ALL_A!G356=\"\",\"\",ALL_A!G356)","v":""},{"$f":"IF(ALL_A!H356=\"\",\"\",ALL_A!H356)","v":""},null,null,null,null,null,null,null,null,null,null,null,null,null,null,null,null,null,null,"","",""]
[1,null,{"$f":"IF(ALL_A!C357=\"\",\"\",ALL_A!C357)","v":""},{"$f":"IF(ALL_A!G357=\"\",\"\",ALL_A!G357)","v":""},{"$f":"IF(ALL_A!H357=\"\",\"\",ALL_A!H357)","v":""},null,null,null,null,null,null,null,null,null,null,null,null,null,null,null,null,null,null,"","",""]
[1,null,{"$f":"IF(ALL_A!C358=\"\",\"\",ALL_A!C358)","v":""},{"$f":"IF(ALL_A!G358=\"\",\"\",ALL_A!G358)","v":""},{"$f":"IF(ALL_A!H358=\"\",\"\",ALL_A!H358)","v":""},null,null,null,null,null,null,null,null,null,null,null,null,null,null,null,null,null,null,"","",""]
[1,null,{"$f":"IF(ALL_A!C359=\"\",\"\",ALL_A!C359)","v":""},{"$f":"IF(ALL_A!G359=\"\",\"\",ALL_A!G359)","v":""},{"$f":"IF(ALL_A!H359=\"\",\"\",ALL_A!H359)","v":""},null,null,null,null,null,null,null,null,null,null,null,null,null,null,null,null,null,null,"","",""]
[1,null,{"$f":"IF(ALL_A!C360=\"\",\"\",ALL_A!C360)","v":""},{"$f":"IF(ALL_A!G360=\"\",\"\",ALL_A!G360)","v":""},{"$f":"IF(ALL_A!H360=\"\",\"\",ALL_A!H360)","v":""},null,null,null,null,null,null,null,null,null,null,null,null,null,null,null,null,null,null,"","",""]
[1,null,{"$f":"IF(ALL_A!C361=\"\",\"\",ALL_A!C361)","v":""},{"$f":"IF(ALL_A!G361=\"\",\"\",ALL_A!G361)","v":""},{"$f":"IF(ALL_A!H361=\"\",\"\",ALL_A!H361)","v":""},null,null,null,null,null,null,null,null,null,null,null,null,null,null,null,null,null,null,"","",""]
[1,null,{"$f":"IF(ALL_A!C362=\"\",\"\",ALL_A!C362)","v":""},{"$f":"IF(ALL_A!G362=\"\",\"\",ALL_A!G362)","v":""},{"$f":"IF(ALL_A!H362=\"\",\"\",ALL_A!H362)","v":""},null,null,null,null,null,null,null,null,null,null,null,null,null,null,null,null,null,null,"","",""]
[1,null,{"$f":"IF(ALL_A!C363=\"\",\"\",ALL_A!C363)","v":""},{"$f":"IF(ALL_A!G363=\"\",\"\",ALL_A!G363)","v":""},{"$f":"IF(ALL_A!H363=\"\",\"\",ALL_A!H363)","v":""},null,null,null,null,null,null,null,null,null,null,null,null,null,null,null,null,null,null,"","",""]
[1,null,{"$f":"IF(ALL_A!C364=\"\",\"\",ALL_A!C364)","v":""},{"$f":"IF(ALL_A!G364=\"\",\"\",ALL_A!G364)","v":""},{"$f":"IF(ALL_A!H364=\"\",\"\",ALL_A!H364)","v":""},null,null,null,null,null,null,null,null,null,null,null,null,null,null,null,null,null,null,"","",""]
[1,null,{"$f":"IF(ALL_A!C365=\"\",\"\",ALL_A!C365)","v":""},{"$f":"IF(ALL_A!G365=\"\",\"\",ALL_A!G365)","v":""},{"$f":"IF(ALL_A!H365=\"\",\"\",ALL_A!H365)","v":""},null,null,null,null,null,null,null,null,null,null,null,null,null,null,null,null,null,null,"","",""]
[1,null,{"$f":"IF(ALL_A!C366=\"\",\"\",ALL_A!C366)","v":""},{"$f":"IF(ALL_A!G366=\"\",\"\",ALL_A!G366)","v":""},{"$f":"IF(ALL_A!H366=\"\",\"\",ALL_A!H366)","v":""},null,null,null,null,null,null,null,null,null,null,null,null,null,null,null,null,null,null,"","",""]
[1,null,{"$f":"IF(ALL_A!C367=\"\",\"\",ALL_A!C367)","v":""},{"$f":"IF(ALL_A!G367=\"\",\"\",ALL_A!G367)","v":""},{"$f":"IF(ALL_A!H367=\"\",\"\",ALL_A!H367)","v":""},null,null,null,null,null,null,null,null,null,null,null,null,null,null,null,null,null,null,"","",""]
[1,null,{"$f":"IF(ALL_A!C368=\"\",\"\",ALL_A!C368)","v":""},{"$f":"IF(ALL_A!G368=\"\",\"\",ALL_A!G368)","v":""},{"$f":"IF(ALL_A!H368=\"\",\"\",ALL_A!H368)","v":""},null,null,null,null,null,null,null,null,null,null,null,null,null,null,null,null,null,null,"","",""]
[1,null,{"$f":"IF(ALL_A!C369=\"\",\"\",ALL_A!C369)","v":""},{"$f":"IF(ALL_A!G369=\"\",\"\",ALL_A!G369)","v":""},{"$f":"IF(ALL_A!H369=\"\",\"\",ALL_A!H369)","v":""},null,null,null,null,null,null,null,null,null,null,null,null,null,null,null,null,null,null,"","",""]
[1,null,{"$f":"IF(ALL_A!C370=\"\",\"\",ALL_A!C370)","v":""},{"$f":"IF(ALL_A!G370=\"\",\"\",ALL_A!G370)","v":""},{"$f":"IF(ALL_A!H370=\"\",\"\",ALL_A!H370)","v":""},null,null,null,null,null,null,null,null,null,null,null,null,null,null,null,null,null,null,"","",""]

{"sheet":"EXP_PREVISIONI_SINTESI","index":18,"n_rows":28,"n_cols":27,"rows_kept":28,"cut":false,"hidden":true,"merged":[]}
["ID","ID_PROGRAMMA","ID_TIPO_PREVISIONE_DETT","ANNO","VALORE",null,null,"ID","DESCRIZIONE","ID_TIPO_PREVISIONE","FLAG_PERCENTUALE"]
[1,null,1010,{"$f":"ALL_A!$F$210","v":2017},{"$f":"ALL_A!F377","v":0},null,null,1010,"FATTURATO",1,false,null,null,null,null,null,null,null,null,null,null,null,null,null,null,{"$f":"IFERROR(SUM(C2:E28),\"#ERR\")","v":141924},{"$f":"COUNTIF(X:Z,\"#ERR\")","v":0}]
[1,null,1010,{"$f":"D2+1","v":2018},{"$f":"ALL_A!G377","v":0},null,null,1020,"QUOTA % DI COSTRUZIONI AERONAUTICHE SUL TOTALE",1,true]
[1,null,1010,{"$f":"D3+1","v":2019},{"$f":"ALL_A!H377","v":0},null,null,2010,"% SU TOTALE FATTURATO",2,true]
[1,null,1020,{"$f":"ALL_A!$F$210","v":2017},{"$f":"ALL_A!F378","v":0},null,null,3010,"FABBRICATI INDUSTRIALI E TERRENI",3,false]
[1,null,1020,{"$f":"D5+1","v":2018},{"$f":"ALL_A!G378","v":0},null,null,3020,"MACCHINARI, IMPIANTI E ATTREZZATURE DI PRODUZIONE",3,false]
[1,null,1020,{"$f":"D6+1","v":2019},{"$f":"ALL_A!H378","v":0},null,null,4010,"INVESTIMENTI R&S (Valori assoluti)",4,false]
[1,null,2010,{"$f":"ALL_A!$F$210","v":2017},{"$f":"ALL_A!F383","v":0},null,null,5010,"INVESTIMENTI TOTALI",5,false]
[1,null,2010,{"$f":"D8+1","v":2018},{"$f":"ALL_A!G383","v":0},null,null,5020,"RICERCA E SVILUPPO",5,false]
[1,null,2010,{"$f":"D9+1","v":2019},{"$f":"ALL_A!H383","v":0},null,null,5030,"ORDINI",5,false]
[1,null,3010,{"$f":"ALL_A!$F$210","v":2017},{"$f":"ALL_A!F387","v":0}]
[1,null,3010,{"$f":"D11+1","v":2018},{"$f":"ALL_A!G387","v":0}]
[1,null,3010,{"$f":"D12+1","v":2019},{"$f":"ALL_A!H387","v":0}]
[1,null,3020,{"$f":"ALL_A!$F$210","v":2017},{"$f":"ALL_A!F388","v":0}]
[1,null,3020,{"$f":"D14+1","v":2018},{"$f":"ALL_A!G388","v":0}]
[1,null,3020,{"$f":"D15+1","v":2019},{"$f":"ALL_A!H388","v":0}]
[1,null,4010,{"$f":"ALL_A!$F$210","v":2017},{"$f":"ALL_A!F393","v":0}]
[1,null,4010,{"$f":"D17+1","v":2018},{"$f":"ALL_A!G393","v":0}]
[1,null,4010,{"$f":"D18+1","v":2019},{"$f":"ALL_A!H393","v":0}]
[1,null,5010,{"$f":"ALL_A!$F$397","v":2019},{"$f":"ALL_A!F398","v":0}]
[1,null,5010,{"$f":"D20+1","v":2020},{"$f":"ALL_A!G398","v":0}]
[1,null,5010,{"$f":"D21+1","v":2021},{"$f":"ALL_A!H398","v":0}]
[1,null,5020,{"$f":"ALL_A!$F$397","v":2019},{"$f":"ALL_A!F399","v":0}]
[1,null,5020,{"$f":"D23+1","v":2020},{"$f":"ALL_A!G399","v":0}]
[1,null,5020,{"$f":"D24+1","v":2021},{"$f":"ALL_A!H399","v":0}]
[1,null,5030,{"$f":"ALL_A!$F$397","v":2019},{"$f":"ALL_A!F400","v":0}]
[1,null,5030,{"$f":"D26+1","v":2020},{"$f":"ALL_A!G400","v":0}]
[1,null,5030,{"$f":"D27+1","v":2021},{"$f":"ALL_A!H400","v":0}]

{"sheet":"EXP_SOGGETTI_BIL","index":19,"n_rows":3,"n_cols":27,"rows_kept":3,"cut":false,"hidden":true,"merged":[]}
["ID","ID_SCHEMA_BILANCIO","ANNO","ID_SOGGETTO","ID_PROGRAMMA","DATA_ACQUISIZIONE","STATO_BILANCIO"]
[null,2,{"$f":"ALL_A.1!D12","v":""},null,null,{"$f":"TODAY()","v":"2019-10-08"},"Approvato",null,null,null,null,null,null,null,null,null,null,null,null,null,null,null,null,{"$f":"IFERROR(SUM(B2:C3),\"#ERR\")","v":4},{"$f":"IFERROR(SUM(F2:F3),\"#ERR\")","v":87492},{"$f":"IFERROR(G2,\"#ERR\")","v":"Approvato"},{"$f":"COUNTIF(X:Z,\"#ERR\")","v":0}]
[null,2,{"$f":"ALL_A.1!E12","v":""},null,null,{"$f":"TODAY()","v":"2019-10-08"},"Approvato",null,null,null,null,null,null,null,null,null,null,null,null,null,null,null,null,null,null,{"$f":"IFERROR(G3,\"#ERR\")","v":"Approvato"}]

{"sheet":"EXP_PREVISIONI_COSTI_DETTAGLIO","index":20,"n_rows":451,"n_cols":27,"rows_kept":451,"cut":false,"hidden":true,"merged":[]}
["ID","ID_PROGRAMMA","ID_TIPOLOGIA_COSTO","ID_FINALITA_COSTO","VOCE","ANNO 1","ANNO 2","ANNO 3","ANNO 4","ANNO 5","ANNO 6",null,"ID","DESCRIZIONE",null,null,"ID_TIPOLOGIA_COSTO","ID_FINALITA_COSTO",null,"S","E","LENGTH"]
[1,null,20,10,{"$f":"IF(ALL_C!C68=\"\",\"\",ALL_C!C68)","v":""},{"$f":"ALL_C!E68","v":0},{"$f":"ALL_C!F68","v":0},{"$f":"ALL_C!G68","v":0},{"$f":"ALL_C!H68","v":0},{"$f":"ALL_C!I68","v":0},{"$f":"ALL_C!J68","v":0},null,10,"PERSONALE",null,1,20,10,{"$f":"Q2&R2","v":"2010"},68,117,{"$f":"U2-T2+1","v":50},{"$f":"V2+1","v":51},{"$f":"IFERROR(SUM(C2:D451),\"#ERR\")","v":22500},{"$f":"IFERROR(E2,\"#ERR\")","v":""},{"$f":"IFERROR(SUM(F2:K451),\"#ERR\")","v":0},{"$f":"COUNTIF(X:Z,\"#ERR\")","v":0}]
[1,null,20,10,{"$f":"IF(ALL_C!C69=\"\",\"\",ALL_C!C69)","v":""},{"$f":"ALL_C!E69","v":0},{"$f":"ALL_C!F69","v":0},{"$f":"ALL_C!G69","v":0},{"$f":"ALL_C!H69","v":0},{"$f":"ALL_C!I69","v":0},{"$f":"ALL_C!J69","v":0},null,15,"PERSONALE NON DIPENDENTE \n (MAX 15% DEL PERSONALE DIPENDENTE)",null,2,20,20,{"$f":"Q3&R3","v":"2020"},122,171,{"$f":"U3-T3+1","v":50},{"$f":"W2+V3","v":101},null,{"$f":"IFERROR(E3,\"#ERR\")","v":""}]
[1,null,20,10,{"$f":"IF(ALL_C!C70=\"\",\"\",ALL_C!C70)","v":""},{"$f":"ALL_C!E70","v":0},{"$f":"ALL_C!F70","v":0},{"$f":"ALL_C!G70","v":0},{"$f":"ALL_C!H70","v":0},{"$f":"ALL_C!I70","v":0},{"$f":"ALL_C!J70","v":0},null,20,"MATERIALI",null,3,20,30,"2030",176,225,50,{"$f":"W3+V4","v":151},null,""]
[1,null,20,10,{"$f":"IF(ALL_C!C71=\"\",\"\",ALL_C!C71)","v":""},{"$f":"ALL_C!E71","v":0},{"$f":"ALL_C!F71","v":0},{"$f":"ALL_C!G71","v":0},{"$f":"ALL_C!H71","v":0},{"$f":"ALL_C!I71","v":0},{"$f":"ALL_C!J71","v":0},null,30,"STRUMENTAZIONE ED ATTREZZATURE",null,4,30,10,"3010",240,289,50,201,null,""]
[1,null,20,10,{"$f":"IF(ALL_C!C72=\"\",\"\",ALL_C!C72)","v":""},{"$f":"ALL_C!E72","v":0},{"$f":"ALL_C!F72","v":0},{"$f":"ALL_C!G72","v":0},{"$f":"ALL_C!H72","v":0},{"$f":"ALL_C!I72","v":0},{"$f":"ALL_C!J72","v":0},null,40,"SERVIZI DI CONSULENZA",null,5,30,20,"3020",294,343,50,251,null,""]
[1,null,20,10,{"$f":"IF(ALL_C!C73=\"\",\"\",ALL_C!C73)","v":""},{"$f":"ALL_C!E73","v":0},{"$f":"ALL_C!F73","v":0},{"$f":"ALL_C!G73","v":0},{"$f":"ALL_C!H73","v":0},{"$f":"ALL_C!I73","v":0},{"$f":"ALL_C!J73","v":0},null,null,null,null,6,30,30,"3030",348,397,50,301,null,""]
[1,null,20,10,{"$f":"IF(ALL_C!C74=\"\",\"\",ALL_C!C74)","v":""},{"$f":"ALL_C!E74","v":0},{"$f":"ALL_C!F74","v":0},{"$f":"ALL_C!G74","v":0},{"$f":"ALL_C!H74","v":0},{"$f":"ALL_C!I74","v":0},{"$f":"ALL_C!J74","v":0},null,"ID","DESCRIZIONE",null,7,40,10,"4010",411,460,50,351,null,""]
[1,null,20,10,{"$f":"IF(ALL_C!C75=\"\",\"\",ALL_C!C75)","v":""},{"$f":"ALL_C!E75","v":0},{"$f":"ALL_C!F75","v":0},{"$f":"ALL_C!G75","v":0},{"$f":"ALL_C!H75","v":0},{"$f":"ALL_C!I75","v":0},{"$f":"ALL_C!J75","v":0},null,10,"STUDI DI FATTIBILITA' TECNICA",null,8,40,20,"4020",465,514,50,401,null,""]
[1,null,20,10,{"$f":"IF(ALL_C!C76=\"\",\"\",ALL_C!C76)","v":""},{"$f":"ALL_C!E76","v":0},{"$f":"ALL_C!F76","v":0},{"$f":"ALL_C!G76","v":0},{"$f":"ALL_C!H76","v":0},{"$f":"ALL_C!I76","v":0},{"$f":"ALL_C!J76","v":0},null,20,"RICERCA INDUSTRIALE",null,9,40,30,"4030",519,568,50,451,null,""]
[1,null,20,10,{"$f":"IF(ALL_C!C77=\"\",\"\",ALL_C!C77)","v":""},{"$f":"ALL_C!E77","v":0},{"$f":"ALL_C!F77","v":0},{"$f":"ALL_C!G77","v":0},{"$f":"ALL_C!H77","v":0},{"$f":"ALL_C!I77","v":0},{"$f":"ALL_C!J77","v":0},null,30,"SVILUPPO SPERIMENTALE",null,null,null,null,null,null,null,null,null,null,""]
[1,null,20,10,{"$f":"IF(ALL_C!C78=\"\",\"\",ALL_C!C78)","v":""},{"$f":"ALL_C!E78","v":0},{"$f":"ALL_C!F78","v":0},{"$f":"ALL_C!G78","v":0},{"$f":"ALL_C!H78","v":0},{"$f":"ALL_C!I78","v":0},{"$f":"ALL_C!J78","v":0},null,null,null,null,"ANNI",15,null,null,null,null,null,null,null,""]
[1,null,20,10,{"$f":"IF(ALL_C!C79=\"\",\"\",ALL_C!C79)","v":""},{"$f":"ALL_C!E79","v":0},{"$f":"ALL_C!F79","v":0},{"$f":"ALL_C!G79","v":0},{"$f":"ALL_C!H79","v":0},{"$f":"ALL_C!I79","v":0},{"$f":"ALL_C!J79","v":0},null,null,null,null,null,null,null,null,null,null,null,null,null,""]
[1,null,20,10,{"$f":"IF(ALL_C!C80=\"\",\"\",ALL_C!C80)","v":""},{"$f":"ALL_C!E80","v":0},{"$f":"ALL_C!F80","v":0},{"$f":"ALL_C!G80","v":0},{"$f":"ALL_C!H80","v":0},{"$f":"ALL_C!I80","v":0},{"$f":"ALL_C!J80","v":0},null,null,null,null,"RIGHE_TOTALI",{"$f":"Q12*SUM(V2:V10)","v":6750},null,null,null,null,null,null,null,""]
[1,null,20,10,{"$f":"IF(ALL_C!C81=\"\",\"\",ALL_C!C81)","v":""},{"$f":"ALL_C!E81","v":0},{"$f":"ALL_C!F81","v":0},{"$f":"ALL_C!G81","v":0},{"$f":"ALL_C!H81","v":0},{"$f":"ALL_C!I81","v":0},{"$f":"ALL_C!J81","v":0},null,null,null,null,null,null,null,null,null,null,null,null,null,""]
[1,null,20,10,{"$f":"IF(ALL_C!C82=\"\",\"\",ALL_C!C82)","v":""},{"$f":"ALL_C!E82","v":0},{"$f":"ALL_C!F82","v":0},{"$f":"ALL_C!G82","v":0},{"$f":"ALL_C!H82","v":0},{"$f":"ALL_C!I82","v":0},{"$f":"ALL_C!J82","v":0},null,null,null,null,null,{"$f":"VLOOKUP(R2,$M$9:$N$11,2,0)","v":"STUDI DI FATTIBILITA' TECNICA"},{"$f":"VLOOKUP(Q2,$M$2:$N$6,2,0)","v":"MATERIALI"},"C",68,"J",117,null,null,""]
[1,null,20,10,{"$f":"IF(ALL_C!C83=\"\",\"\",ALL_C!C83)","v":""},{"$f":"ALL_C!E83","v":0},{"$f":"ALL_C!F83","v":0},{"$f":"ALL_C!G83","v":0},{"$f":"ALL_C!H83","v":0},{"$f":"ALL_C!I83","v":0},{"$f":"ALL_C!J83","v":0},null,null,null,null,null,"RICERCA INDUSTRIALE","MATERIALI","C",122,"J",171,null,null,""]
[1,null,20,10,{"$f":"IF(ALL_C!C84=\"\",\"\",ALL_C!C84)","v":""},{"$f":"ALL_C!E84","v":0},{"$f":"ALL_C!F84","v":0},{"$f":"ALL_C!G84","v":0},{"$f":"ALL_C!H84","v":0},{"$f":"ALL_C!I84","v":0},{"$f":"ALL_C!J84","v":0},null,null,null,null,null,"SVILUPPO SPERIMENTALE","MATERIALI","C",176,"J",225,null,null,""]
[1,null,20,10,{"$f":"IF(ALL_C!C85=\"\",\"\",ALL_C!C85)","v":""},{"$f":"ALL_C!E85","v":0},{"$f":"ALL_C!F85","v":0},{"$f":"ALL_C!G85","v":0},{"$f":"ALL_C!H85","v":0},{"$f":"ALL_C!I85","v":0},{"$f":"ALL_C!J85","v":0},null,null,null,null,null,"STUDI DI FATTIBILITA' TECNICA","STRUMENTAZIONE ED ATTREZZATURE","C",240,"J",289,null,null,""]
[1,null,20,10,{"$f":"IF(ALL_C!C86=\"\",\"\",ALL_C!C86)","v":""},{"$f":"ALL_C!E86","v":0},{"$f":"ALL_C!F86","v":0},{"$f":"ALL_C!G86","v":0},{"$f":"ALL_C!H86","v":0},{"$f":"ALL_C!I86","v":0},{"$f":"ALL_C!J86","v":0},null,null,null,null,null,"RICERCA INDUSTRIALE","STRUMENTAZIONE ED ATTREZZATURE","C",294,"J",343,null,null,""]
[1,null,20,10,{"$f":"IF(ALL_C!C87=\"\",\"\",ALL_C!C87)","v":""},{"$f":"ALL_C!E87","v":0},{"$f":"ALL_C!F87","v":0},{"$f":"ALL_C!G87","v":0},{"$f":"ALL_C!H87","v":0},{"$f":"ALL_C!I87","v":0},{"$f":"ALL_C!J87","v":0},null,null,null,null,null,"SVILUPPO SPERIMENTALE","STRUMENTAZIONE ED ATTREZZATURE","C",348,"J",397,null,null,""]
[1,null,20,10,{"$f":"IF(ALL_C!C88=\"\",\"\",ALL_C!C88)","v":""},{"$f":"ALL_C!E88","v":0},{"$f":"ALL_C!F88","v":0},{"$f":"ALL_C!G88","v":0},{"$f":"ALL_C!H88","v":0},{"$f":"ALL_C!I88","v":0},{"$f":"ALL_C!J88","v":0},null,null,null,null,null,"STUDI DI FATTIBILITA' TECNICA","SERVIZI DI CONSULENZA","C",411,"J",460,null,null,""]
[1,null,20,10,{"$f":"IF(ALL_C!C89=\"\",\"\",ALL_C!C89)","v":""},{"$f":"ALL_C!E89","v":0},{"$f":"ALL_C!F89","v":0},{"$f":"ALL_C!G89","v":0},{"$f":"ALL_C!H89","v":0},{"$f":"ALL_C!I89","v":0},{"$f":"ALL_C!J89","v":0},null,null,null,null,null,"RICERCA INDUSTRIALE","SERVIZI DI CONSULENZA","C",465,"J",514,null,null,""]
[1,null,20,10,{"$f":"IF(ALL_C!C90=\"\",\"\",ALL_C!C90)","v":""},{"$f":"ALL_C!E90","v":0},{"$f":"ALL_C!F90","v":0},{"$f":"ALL_C!G90","v":0},{"$f":"ALL_C!H90","v":0},{"$f":"ALL_C!I90","v":0},{"$f":"ALL_C!J90","v":0},null,null,null,null,null,"SVILUPPO SPERIMENTALE","SERVIZI DI CONSULENZA","C",519,"J",568,null,null,""]
[1,null,20,10,{"$f":"IF(ALL_C!C91=\"\",\"\",ALL_C!C91)","v":""},{"$f":"ALL_C!E91","v":0},{"$f":"ALL_C!F91","v":0},{"$f":"ALL_C!G91","v":0},{"$f":"ALL_C!H91","v":0},{"$f":"ALL_C!I91","v":0},{"$f":"ALL_C!J91","v":0},null,null,null,null,null,null,null,null,null,null,null,null,null,""]
[1,null,20,10,{"$f":"IF(ALL_C!C92=\"\",\"\",ALL_C!C92)","v":""},{"$f":"ALL_C!E92","v":0},{"$f":"ALL_C!F92","v":0},{"$f":"ALL_C!G92","v":0},{"$f":"ALL_C!H92","v":0},{"$f":"ALL_C!I92","v":0},{"$f":"ALL_C!J92","v":0},null,null,null,null,null,null,null,null,null,null,null,null,null,""]
[1,null,20,10,{"$f":"IF(ALL_C!C93=\"\",\"\",ALL_C!C93)","v":""},{"$f":"ALL_C!E93","v":0},{"$f":"ALL_C!F93","v":0},{"$f":"ALL_C!G93","v":0},{"$f":"ALL_C!H93","v":0},{"$f":"ALL_C!I93","v":0},{"$f":"ALL_C!J93","v":0},null,null,null,null,null,1,{"$f":"$U$1","v":"E"},{"$f":"$T$1","v":"S"},{"$f":"T2","v":68},117,null,{"$f":"CONCATENATE(\"Range(\",R27,T27,\":\",S27,U27,\"\",\")\")","v":"Range(E68:S117)"},null,""]
[1,null,20,10,{"$f":"IF(ALL_C!C94=\"\",\"\",ALL_C!C94)","v":""},{"$f":"ALL_C!E94","v":0},{"$f":"ALL_C!F94","v":0},{"$f":"ALL_C!G94","v":0},{"$f":"ALL_C!H94","v":0},{"$f":"ALL_C!I94","v":0},{"$f":"ALL_C!J94","v":0},null,null,null,null,null,2,{"$f":"$U$1","v":"E"},{"$f":"$T$1","v":"S"},122,171,null,{"$f":"CONCATENATE(\"Range(\",R28,T28,\":\",S28,U28,\"\",\")\")","v":"Range(E122:S171)"},null,""]
[1,null,20,10,{"$f":"IF(ALL_C!C95=\"\",\"\",ALL_C!C95)","v":""},{"$f":"ALL_C!E95","v":0},{"$f":"ALL_C!F95","v":0},{"$f":"ALL_C!G95","v":0},{"$f":"ALL_C!H95","v":0},{"$f":"ALL_C!I95","v":0},{"$f":"ALL_C!J95","v":0},null,null,null,null,null,3,"E","S",176,225,null,"Range(E176:S225)",null,""]
[1,null,20,10,{"$f":"IF(ALL_C!C96=\"\",\"\",ALL_C!C96)","v":""},{"$f":"ALL_C!E96","v":0},{"$f":"ALL_C!F96","v":0},{"$f":"ALL_C!G96","v":0},{"$f":"ALL_C!H96","v":0},{"$f":"ALL_C!I96","v":0},{"$f":"ALL_C!J96","v":0},null,null,null,null,null,4,"E","S",240,289,null,"Range(E240:S289)",null,""]
[1,null,20,10,{"$f":"IF(ALL_C!C97=\"\",\"\",ALL_C!C97)","v":""},{"$f":"ALL_C!E97","v":0},{"$f":"ALL_C!F97","v":0},{"$f":"ALL_C!G97","v":0},{"$f":"ALL_C!H97","v":0},{"$f":"ALL_C!I97","v":0},{"$f":"ALL_C!J97","v":0},null,null,null,null,null,5,"E","S",294,343,null,"Range(E294:S343)",null,""]
[1,null,20,10,{"$f":"IF(ALL_C!C98=\"\",\"\",ALL_C!C98)","v":""},{"$f":"ALL_C!E98","v":0},{"$f":"ALL_C!F98","v":0},{"$f":"ALL_C!G98","v":0},{"$f":"ALL_C!H98","v":0},{"$f":"ALL_C!I98","v":0},{"$f":"ALL_C!J98","v":0},null,null,null,null,null,6,"E","S",348,397,null,"Range(E348:S397)",null,""]
[1,null,20,10,{"$f":"IF(ALL_C!C99=\"\",\"\",ALL_C!C99)","v":""},{"$f":"ALL_C!E99","v":0},{"$f":"ALL_C!F99","v":0},{"$f":"ALL_C!G99","v":0},{"$f":"ALL_C!H99","v":0},{"$f":"ALL_C!I99","v":0},{"$f":"ALL_C!J99","v":0},null,null,null,null,null,7,"E","S",411,460,null,"Range(E411:S460)",null,""]
[1,null,20,10,{"$f":"IF(ALL_C!C100=\"\",\"\",ALL_C!C100)","v":""},{"$f":"ALL_C!E100","v":0},{"$f":"ALL_C!F100","v":0},{"$f":"ALL_C!G100","v":0},{"$f":"ALL_C!H100","v":0},{"$f":"ALL_C!I100","v":0},{"$f":"ALL_C!J100","v":0},null,null,null,null,null,8,"E","S",465,514,null,"Range(E465:S514)",null,""]
[1,null,20,10,{"$f":"IF(ALL_C!C101=\"\",\"\",ALL_C!C101)","v":""},{"$f":"ALL_C!E101","v":0},{"$f":"ALL_C!F101","v":0},{"$f":"ALL_C!G101","v":0},{"$f":"ALL_C!H101","v":0},{"$f":"ALL_C!I101","v":0},{"$f":"ALL_C!J101","v":0},null,null,null,null,null,9,"E","S",519,568,null,"Range(E519:S568)",null,""]
[1,null,20,10,{"$f":"IF(ALL_C!C102=\"\",\"\",ALL_C!C102)","v":""},{"$f":"ALL_C!E102","v":0},{"$f":"ALL_C!F102","v":0},{"$f":"ALL_C!G102","v":0},{"$f":"ALL_C!H102","v":0},{"$f":"ALL_C!I102","v":0},{"$f":"ALL_C!J102","v":0},null,null,null,null,null,null,null,null,null,null,null,null,null,""]
[1,null,20,10,{"$f":"IF(ALL_C!C103=\"\",\"\",ALL_C!C103)","v":""},{"$f":"ALL_C!E103","v":0},{"$f":"ALL_C!F103","v":0},{"$f":"ALL_C!G103","v":0},{"$f":"ALL_C!H103","v":0},{"$f":"ALL_C!I103","v":0},{"$f":"ALL_C!J103","v":0},null,null,null,null,null,null,null,null,null,null,null,null,null,""]
[1,null,20,10,{"$f":"IF(ALL_C!C104=\"\",\"\",ALL_C!C104)","v":""},{"$f":"ALL_C!E104","v":0},{"$f":"ALL_C!F104","v":0},{"$f":"ALL_C!G104","v":0},{"$f":"ALL_C!H104","v":0},{"$f":"ALL_C!I104","v":0},{"$f":"ALL_C!J104","v":0},null,null,null,null,null,null,null,null,null,null,null,null,null,""]
[1,null,20,10,{"$f":"IF(ALL_C!C105=\"\",\"\",ALL_C!C105)","v":""},{"$f":"ALL_C!E105","v":0},{"$f":"ALL_C!F105","v":0},{"$f":"ALL_C!G105","v":0},{"$f":"ALL_C!H105","v":0},{"$f":"ALL_C!I105","v":0},{"$f":"ALL_C!J105","v":0},null,null,null,null,null,null,null,null,null,null,null,null,null,""]
[1,null,20,10,{"$f":"IF(ALL_C!C106=\"\",\"\",ALL_C!C106)","v":""},{"$f":"ALL_C!E106","v":0},{"$f":"ALL_C!F106","v":0},{"$f":"ALL_C!G106","v":0},{"$f":"ALL_C!H106","v":0},{"$f":"ALL_C!I106","v":0},{"$f":"ALL_C!J106","v":0},null,null,null,null,null,null,null,null,null,null,null,null,null,""]
[1,null,20,10,{"$f":"IF(ALL_C!C107=\"\",\"\",ALL_C!C107)","v":""},{"$f":"ALL_C!E107","v":0},{"$f":"ALL_C!F107","v":0},{"$f":"ALL_C!G107","v":0},{"$f":"ALL_C!H107","v":0},{"$f":"ALL_C!I107","v":0},{"$f":"ALL_C!J107","v":0},null,null,null,null,null,null,null,null,null,null,null,null,null,""]
[1,null,20,10,{"$f":"IF(ALL_C!C108=\"\",\"\",ALL_C!C108)","v":""},{"$f":"ALL_C!E108","v":0},{"$f":"ALL_C!F108","v":0},{"$f":"ALL_C!G108","v":0},{"$f":"ALL_C!H108","v":0},{"$f":"ALL_C!I108","v":0},{"$f":"ALL_C!J108","v":0},null,null,null,null,null,null,null,null,null,null,null,null,null,""]
[1,null,20,10,{"$f":"IF(ALL_C!C109=\"\",\"\",ALL_C!C109)","v":""},{"$f":"ALL_C!E109","v":0},{"$f":"ALL_C!F109","v":0},{"$f":"ALL_C!G109","v":0},{"$f":"ALL_C!H109","v":0},{"$f":"ALL_C!I109","v":0},{"$f":"ALL_C!J109","v":0},null,null,null,null,null,null,null,null,null,null,null,null,null,""]
[1,null,20,10,{"$f":"IF(ALL_C!C110=\"\",\"\",ALL_C!C110)","v":""},{"$f":"ALL_C!E110","v":0},{"$f":"ALL_C!F110","v":0},{"$f":"ALL_C!G110","v":0},{"$f":"ALL_C!H110","v":0},{"$f":"ALL_C!I110","v":0},{"$f":"ALL_C!J110","v":0},null,null,null,null,null,null,null,null,null,null,null,null,null,""]
[1,null,20,10,{"$f":"IF(ALL_C!C111=\"\",\"\",ALL_C!C111)","v":""},{"$f":"ALL_C!E111","v":0},{"$f":"ALL_C!F111","v":0},{"$f":"ALL_C!G111","v":0},{"$f":"ALL_C!H111","v":0},{"$f":"ALL_C!I111","v":0},{"$f":"ALL_C!J111","v":0},null,null,null,null,null,null,null,null,null,null,null,null,null,""]
[1,null,20,10,{"$f":"IF(ALL_C!C112=\"\",\"\",ALL_C!C112)","v":""},{"$f":"ALL_C!E112","v":0},{"$f":"ALL_C!F112","v":0},{"$f":"ALL_C!G112","v":0},{"$f":"ALL_C!H112","v":0},{"$f":"ALL_C!I112","v":0},{"$f":"ALL_C!J112","v":0},null,null,null,null,null,null,null,null,null,null,null,null,null,""]
[1,null,20,10,{"$f":"IF(ALL_C!C113=\"\",\"\",ALL_C!C113)","v":""},{"$f":"ALL_C!E113","v":0},{"$f":"ALL_C!F113","v":0},{"$f":"ALL_C!G113","v":0},{"$f":"ALL_C!H113","v":0},{"$f":"ALL_C!I113","v":0},{"$f":"ALL_C!J113","v":0},null,null,null,null,null,null,null,null,null,null,null,null,null,""]
[1,null,20,10,{"$f":"IF(ALL_C!C114=\"\",\"\",ALL_C!C114)","v":""},{"$f":"ALL_C!E114","v":0},{"$f":"ALL_C!F114","v":0},{"$f":"ALL_C!G114","v":0},{"$f":"ALL_C!H114","v":0},{"$f":"ALL_C!I114","v":0},{"$f":"ALL_C!J114","v":0},null,null,null,null,null,null,null,null,null,null,null,null,null,""]
[1,null,20,10,{"$f":"IF(ALL_C!C115=\"\",\"\",ALL_C!C115)","v":""},{"$f":"ALL_C!E115","v":0},{"$f":"ALL_C!F115","v":0},{"$f":"ALL_C!G115","v":0},{"$f":"ALL_C!H115","v":0},{"$f":"ALL_C!I115","v":0},{"$f":"ALL_C!J115","v":0},null,null,null,null,null,null,null,null,null,null,null,null,null,""]
[1,null,20,10,{"$f":"IF(ALL_C!C116=\"\",\"\",ALL_C!C116)","v":""},{"$f":"ALL_C!E116","v":0},{"$f":"ALL_C!F116","v":0},{"$f":"ALL_C!G116","v":0},{"$f":"ALL_C!H116","v":0},{"$f":"ALL_C!I116","v":0},{"$f":"ALL_C!J116","v":0},null,null,null,null,null,null,null,null,null,null,null,null,null,""]
[1,null,20,10,{"$f":"IF(ALL_C!C117=\"\",\"\",ALL_C!C117)","v":""},{"$f":"ALL_C!E117","v":0},{"$f":"ALL_C!F117","v":0},{"$f":"ALL_C!G117","v":0},{"$f":"ALL_C!H117","v":0},{"$f":"ALL_C!I117","v":0},{"$f":"ALL_C!J117","v":0},null,null,null,null,null,null,null,null,null,null,null,null,null,""]
[1,null,20,20,{"$f":"IF(ALL_C!C122=\"\",\"\",ALL_C!C122)","v":""},{"$f":"ALL_C!E122","v":0},{"$f":"ALL_C!F122","v":0},{"$f":"ALL_C!G122","v":0},{"$f":"ALL_C!H122","v":0},{"$f":"ALL_C!I122","v":0},{"$f":"ALL_C!J122","v":0},null,null,null,null,null,null,null,null,null,null,null,null,null,""]
[1,null,20,20,{"$f":"IF(ALL_C!C123=\"\",\"\",ALL_C!C123)","v":""},{"$f":"ALL_C!E123","v":0},{"$f":"ALL_C!F123","v":0},{"$f":"ALL_C!G123","v":0},{"$f":"ALL_C!H123","v":0},{"$f":"ALL_C!I123","v":0},{"$f":"ALL_C!J123","v":0},null,null,null,null,null,null,null,null,null,null,null,null,null,""]
[1,null,20,20,{"$f":"IF(ALL_C!C124=\"\",\"\",ALL_C!C124)","v":""},{"$f":"ALL_C!E124","v":0},{"$f":"ALL_C!F124","v":0},{"$f":"ALL_C!G124","v":0},{"$f":"ALL_C!H124","v":0},{"$f":"ALL_C!I124","v":0},{"$f":"ALL_C!J124","v":0},null,null,null,null,null,null,null,null,null,null,null,null,null,""]
[1,null,20,20,{"$f":"IF(ALL_C!C125=\"\",\"\",ALL_C!C125)","v":""},{"$f":"ALL_C!E125","v":0},{"$f":"ALL_C!F125","v":0},{"$f":"ALL_C!G125","v":0},{"$f":"ALL_C!H125","v":0},{"$f":"ALL_C!I125","v":0},{"$f":"ALL_C!J125","v":0},null,null,null,null,null,null,null,null,null,null,null,null,null,""]
[1,null,20,20,{"$f":"IF(ALL_C!C126=\"\",\"\",ALL_C!C126)","v":""},{"$f":"ALL_C!E126","v":0},{"$f":"ALL_C!F126","v":0},{"$f":"ALL_C!G126","v":0},{"$f":"ALL_C!H126","v":0},{"$f":"ALL_C!I126","v":0},{"$f":"ALL_C!J126","v":0},null,null,null,null,null,null,null,null,null,null,null,null,null,""]
[1,null,20,20,{"$f":"IF(ALL_C!C127=\"\",\"\",ALL_C!C127)","v":""},{"$f":"ALL_C!E127","v":0},{"$f":"ALL_C!F127","v":0},{"$f":"ALL_C!G127","v":0},{"$f":"ALL_C!H127","v":0},{"$f":"ALL_C!I127","v":0},{"$f":"ALL_C!J127","v":0},null,null,null,null,null,null,null,null,null,null,null,null,null,""]
[1,null,20,20,{"$f":"IF(ALL_C!C128=\"\",\"\",ALL_C!C128)","v":""},{"$f":"ALL_C!E128","v":0},{"$f":"ALL_C!F128","v":0},{"$f":"ALL_C!G128","v":0},{"$f":"ALL_C!H128","v":0},{"$f":"ALL_C!I128","v":0},{"$f":"ALL_C!J128","v":0},null,null,null,null,null,null,null,null,null,null,null,null,null,""]
[1,null,20,20,{"$f":"IF(ALL_C!C129=\"\",\"\",ALL_C!C129)","v":""},{"$f":"ALL_C!E129","v":0},{"$f":"ALL_C!F129","v":0},{"$f":"ALL_C!G129","v":0},{"$f":"ALL_C!H129","v":0},{"$f":"ALL_C!I129","v":0},{"$f":"ALL_C!J129","v":0},null,null,null,null,null,null,null,null,null,null,null,null,null,""]
[1,null,20,20,{"$f":"IF(ALL_C!C130=\"\",\"\",ALL_C!C130)","v":""},{"$f":"ALL_C!E130","v":0},{"$f":"ALL_C!F130","v":0},{"$f":"ALL_C!G130","v":0},{"$f":"ALL_C!H130","v":0},{"$f":"ALL_C!I130","v":0},{"$f":"ALL_C!J130","v":0},null,null,null,null,null,null,null,null,null,null,null,null,null,""]
[1,null,20,20,{"$f":"IF(ALL_C!C131=\"\",\"\",ALL_C!C131)","v":""},{"$f":"ALL_C!E131","v":0},{"$f":"ALL_C!F131","v":0},{"$f":"ALL_C!G131","v":0},{"$f":"ALL_C!H131","v":0},{"$f":"ALL_C!I131","v":0},{"$f":"ALL_C!J131","v":0},null,null,null,null,null,null,null,null,null,null,null,null,null,""]
[1,null,20,20,{"$f":"IF(ALL_C!C132=\"\",\"\",ALL_C!C132)","v":""},{"$f":"ALL_C!E132","v":0},{"$f":"ALL_C!F132","v":0},{"$f":"ALL_C!G132","v":0},{"$f":"ALL_C!H132","v":0},{"$f":"ALL_C!I132","v":0},{"$f":"ALL_C!J132","v":0},null,null,null,null,null,null,null,null,null,null,null,null,null,""]
[1,null,20,20,{"$f":"IF(ALL_C!C133=\"\",\"\",ALL_C!C133)","v":""},{"$f":"ALL_C!E133","v":0},{"$f":"ALL_C!F133","v":0},{"$f":"ALL_C!G133","v":0},{"$f":"ALL_C!H133","v":0},{"$f":"ALL_C!I133","v":0},{"$f":"ALL_C!J133","v":0},null,null,null,null,null,null,null,null,null,null,null,null,null,""]
[1,null,20,20,{"$f":"IF(ALL_C!C134=\"\",\"\",ALL_C!C134)","v":""},{"$f":"ALL_C!E134","v":0},{"$f":"ALL_C!F134","v":0},{"$f":"ALL_C!G134","v":0},{"$f":"ALL_C!H134","v":0},{"$f":"ALL_C!I134","v":0},{"$f":"ALL_C!J134","v":0},null,null,null,null,null,null,null,null,null,null,null,null,null,""]
[1,null,20,20,{"$f":"IF(ALL_C!C135=\"\",\"\",ALL_C!C135)","v":""},{"$f":"ALL_C!E135","v":0},{"$f":"ALL_C!F135","v":0},{"$f":"ALL_C!G135","v":0},{"$f":"ALL_C!H135","v":0},{"$f":"ALL_C!I135","v":0},{"$f":"ALL_C!J135","v":0},null,null,null,null,null,null,null,null,null,null,null,null,null,""]
[1,null,20,20,{"$f":"IF(ALL_C!C136=\"\",\"\",ALL_C!C136)","v":""},{"$f":"ALL_C!E136","v":0},{"$f":"ALL_C!F136","v":0},{"$f":"ALL_C!G136","v":0},{"$f":"ALL_C!H136","v":0},{"$f":"ALL_C!I136","v":0},{"$f":"ALL_C!J136","v":0},null,null,null,null,null,null,null,null,null,null,null,null,null,""]
[1,null,20,20,{"$f":"IF(ALL_C!C137=\"\",\"\",ALL_C!C137)","v":""},{"$f":"ALL_C!E137","v":0},{"$f":"ALL_C!F137","v":0},{"$f":"ALL_C!G137","v":0},{"$f":"ALL_C!H137","v":0},{"$f":"ALL_C!I137","v":0},{"$f":"ALL_C!J137","v":0},null,null,null,null,null,null,null,null,null,null,null,null,null,{"$f":"IFERROR(E67,\"#ERR\")","v":""}]
[1,null,20,20,{"$f":"IF(ALL_C!C138=\"\",\"\",ALL_C!C138)","v":""},{"$f":"ALL_C!E138","v":0},{"$f":"ALL_C!F138","v":0},{"$f":"ALL_C!G138","v":0},{"$f":"ALL_C!H138","v":0},{"$f":"ALL_C!I138","v":0},{"$f":"ALL_C!J138","v":0},null,null,null,null,null,null,null,null,null,null,null,null,null,""]
[1,null,20,20,{"$f":"IF(ALL_C!C139=\"\",\"\",ALL_C!C139)","v":""},{"$f":"ALL_C!E139","v":0},{"$f":"ALL_C!F139","v":0},{"$f":"ALL_C!G139","v":0},{"$f":"ALL_C!H139","v":0},{"$f":"ALL_C!I139","v":0},{"$f":"ALL_C!J139","v":0},null,null,null,null,null,null,null,null,null,null,null,null,null,""]
[1,null,20,20,{"$f":"IF(ALL_C!C140=\"\",\"\",ALL_C!C140)","v":""},{"$f":"ALL_C!E140","v":0},{"$f":"ALL_C!F140","v":0},{"$f":"ALL_C!G140","v":0},{"$f":"ALL_C!H140","v":0},{"$f":"ALL_C!I140","v":0},{"$f":"ALL_C!J140","v":0},null,null,null,null,null,null,null,null,null,null,null,null,null,""]
[1,null,20,20,{"$f":"IF(ALL_C!C141=\"\",\"\",ALL_C!C141)","v":""},{"$f":"ALL_C!E141","v":0},{"$f":"ALL_C!F141","v":0},{"$f":"ALL_C!G141","v":0},{"$f":"ALL_C!H141","v":0},{"$f":"ALL_C!I141","v":0},{"$f":"ALL_C!J141","v":0},null,null,null,null,null,null,null,null,null,null,null,null,null,""]
[1,null,20,20,{"$f":"IF(ALL_C!C142=\"\",\"\",ALL_C!C142)","v":""},{"$f":"ALL_C!E142","v":0},{"$f":"ALL_C!F142","v":0},{"$f":"ALL_C!G142","v":0},{"$f":"ALL_C!H142","v":0},{"$f":"ALL_C!I142","v":0},{"$f":"ALL_C!J142","v":0},null,null,null,null,null,null,null,null,null,null,null,null,null,""]
[1,null,20,20,{"$f":"IF(ALL_C!C143=\"\",\"\",ALL_C!C143)","v":""},{"$f":"ALL_C!E143","v":0},{"$f":"ALL_C!F143","v":0},{"$f":"ALL_C!G143","v":0},{"$f":"ALL_C!H143","v":0},{"$f":"ALL_C!I143","v":0},{"$f":"ALL_C!J143","v":0},null,null,null,null,null,null,null,null,null,null,null,null,null,""]
[1,null,20,20,{"$f":"IF(ALL_C!C144=\"\",\"\",ALL_C!C144)","v":""},{"$f":"ALL_C!E144","v":0},{"$f":"ALL_C!F144","v":0},{"$f":"ALL_C!G144","v":0},{"$f":"ALL_C!H144","v":0},{"$f":"ALL_C!I144","v":0},{"$f":"ALL_C!J144","v":0},null,null,null,null,null,null,null,null,null,null,null,null,null,""]
[1,null,20,20,{"$f":"IF(ALL_C!C145=\"\",\"\",ALL_C!C145)","v":""},{"$f":"ALL_C!E145","v":0},{"$f":"ALL_C!F145","v":0},{"$f":"ALL_C!G145","v":0},{"$f":"ALL_C!H145","v":0},{"$f":"ALL_C!I145","v":0},{"$f":"ALL_C!J145","v":0},null,null,null,null,null,null,null,null,null,null,null,null,null,""]
[1,null,20,20,{"$f":"IF(ALL_C!C146=\"\",\"\",ALL_C!C146)","v":""},{"$f":"ALL_C!E146","v":0},{"$f":"ALL_C!F146","v":0},{"$f":"ALL_C!G146","v":0},{"$f":"ALL_C!H146","v":0},{"$f":"ALL_C!I146","v":0},{"$f":"ALL_C!J146","v":0},null,null,null,null,null,null,null,null,null,null,null,null,null,""]
[1,null,20,20,{"$f":"IF(ALL_C!C147=\"\",\"\",ALL_C!C147)","v":""},{"$f":"ALL_C!E147","v":0},{"$f":"ALL_C!F147","v":0},{"$f":"ALL_C!G147","v":0},{"$f":"ALL_C!H147","v":0},{"$f":"ALL_C!I147","v":0},{"$f":"ALL_C!J147","v":0},null,null,null,null,null,null,null,null,null,null,null,null,null,""]
[1,null,20,20,{"$f":"IF(ALL_C!C148=\"\",\"\",ALL_C!C148)","v":""},{"$f":"ALL_C!E148","v":0},{"$f":"ALL_C!F148","v":0},{"$f":"ALL_C!G148","v":0},{"$f":"ALL_C!H148","v":0},{"$f":"ALL_C!I148","v":0},{"$f":"ALL_C!J148","v":0},null,null,null,null,null,null,null,null,null,null,null,null,null,""]
[1,null,20,20,{"$f":"IF(ALL_C!C149=\"\",\"\",ALL_C!C149)","v":""},{"$f":"ALL_C!E149","v":0},{"$f":"ALL_C!F149","v":0},{"$f":"ALL_C!G149","v":0},{"$f":"ALL_C!H149","v":0},{"$f":"ALL_C!I149","v":0},{"$f":"ALL_C!J149","v":0},null,null,null,null,null,null,null,null,null,null,null,null,null,""]
[1,null,20,20,{"$f":"IF(ALL_C!C150=\"\",\"\",ALL_C!C150)","v":""},{"$f":"ALL_C!E150","v":0},{"$f":"ALL_C!F150","v":0},{"$f":"ALL_C!G150","v":0},{"$f":"ALL_C!H150","v":0},{"$f":"ALL_C!I150","v":0},{"$f":"ALL_C!J150","v":0},null,null,null,null,null,null,null,null,null,null,null,null,null,""]
[1,null,20,20,{"$f":"IF(ALL_C!C151=\"\",\"\",ALL_C!C151)","v":""},{"$f":"ALL_C!E151","v":0},{"$f":"ALL_C!F151","v":0},{"$f":"ALL_C!G151","v":0},{"$f":"ALL_C!H151","v":0},{"$f":"ALL_C!I151","v":0},{"$f":"ALL_C!J151","v":0},null,null,null,null,null,null,null,null,null,null,null,null,null,""]
[1,null,20,20,{"$f":"IF(ALL_C!C152=\"\",\"\",ALL_C!C152)","v":""},{"$f":"ALL_C!E152","v":0},{"$f":"ALL_C!F152","v":0},{"$f":"ALL_C!G152","v":0},{"$f":"ALL_C!H152","v":0},{"$f":"ALL_C!I152","v":0},{"$f":"ALL_C!J152","v":0},null,null,null,null,null,null,null,null,null,null,null,null,null,""]
[1,null,20,20,{"$f":"IF(ALL_C!C153=\"\",\"\",ALL_C!C153)","v":""},{"$f":"ALL_C!E153","v":0},{"$f":"ALL_C!F153","v":0},{"$f":"ALL_C!G153","v":0},{"$f":"ALL_C!H153","v":0},{"$f":"ALL_C!I153","v":0},{"$f":"ALL_C!J153","v":0},null,null,null,null,null,null,null,null,null,null,null,null,null,""]
[1,null,20,20,{"$f":"IF(ALL_C!C154=\"\",\"\",ALL_C!C154)","v":""},{"$f":"ALL_C!E154","v":0},{"$f":"ALL_C!F154","v":0},{"$f":"ALL_C!G154","v":0},{"$f":"ALL_C!H154","v":0},{"$f":"ALL_C!I154","v":0},{"$f":"ALL_C!J154","v":0},null,null,null,null,null,null,null,null,null,null,null,null,null,""]
[1,null,20,20,{"$f":"IF(ALL_C!C155=\"\",\"\",ALL_C!C155)","v":""},{"$f":"ALL_C!E155","v":0},{"$f":"ALL_C!F155","v":0},{"$f":"ALL_C!G155","v":0},{"$f":"ALL_C!H155","v":0},{"$f":"ALL_C!I155","v":0},{"$f":"ALL_C!J155","v":0},null,null,null,null,null,null,null,null,null,null,null,null,null,""]
[1,null,20,20,{"$f":"IF(ALL_C!C156=\"\",\"\",ALL_C!C156)","v":""},{"$f":"ALL_C!E156","v":0},{"$f":"ALL_C!F156","v":0},{"$f":"ALL_C!G156","v":0},{"$f":"ALL_C!H156","v":0},{"$f":"ALL_C!I156","v":0},{"$f":"ALL_C!J156","v":0},null,null,null,null,null,null,null,null,null,null,null,null,null,""]
[1,null,20,20,{"$f":"IF(ALL_C!C157=\"\",\"\",ALL_C!C157)","v":""},{"$f":"ALL_C!E157","v":0},{"$f":"ALL_C!F157","v":0},{"$f":"ALL_C!G157","v":0},{"$f":"ALL_C!H157","v":0},{"$f":"ALL_C!I157","v":0},{"$f":"ALL_C!J157","v":0},null,null,null,null,null,null,null,null,null,null,null,null,null,""]
[1,null,20,20,{"$f":"IF(ALL_C!C158=\"\",\"\",ALL_C!C158)","v":""},{"$f":"ALL_C!E158","v":0},{"$f":"ALL_C!F158","v":0},{"$f":"ALL_C!G158","v":0},{"$f":"ALL_C!H158","v":0},{"$f":"ALL_C!I158","v":0},{"$f":"ALL_C!J158","v":0},null,null,null,null,null,null,null,null,null,null,null,null,null,""]
[1,null,20,20,{"$f":"IF(ALL_C!C159=\"\",\"\",ALL_C!C159)","v":""},{"$f":"ALL_C!E159","v":0},{"$f":"ALL_C!F159","v":0},{"$f":"ALL_C!G159","v":0},{"$f":"ALL_C!H159","v":0},{"$f":"ALL_C!I159","v":0},{"$f":"ALL_C!J159","v":0},null,null,null,null,null,null,null,null,null,null,null,null,null,""]
[1,null,20,20,{"$f":"IF(ALL_C!C160=\"\",\"\",ALL_C!C160)","v":""},{"$f":"ALL_C!E160","v":0},{"$f":"ALL_C!F160","v":0},{"$f":"ALL_C!G160","v":0},{"$f":"ALL_C!H160","v":0},{"$f":"ALL_C!I160","v":0},{"$f":"ALL_C!J160","v":0},null,null,null,null,null,null,null,null,null,null,null,null,null,""]
[1,null,20,20,{"$f":"IF(ALL_C!C161=\"\",\"\",ALL_C!C161)","v":""},{"$f":"ALL_C!E161","v":0},{"$f":"ALL_C!F161","v":0},{"$f":"ALL_C!G161","v":0},{"$f":"ALL_C!H161","v":0},{"$f":"ALL_C!I161","v":0},{"$f":"ALL_C!J161","v":0},null,null,null,null,null,null,null,null,null,null,null,null,null,""]
[1,null,20,20,{"$f":"IF(ALL_C!C162=\"\",\"\",ALL_C!C162)","v":""},{"$f":"ALL_C!E162","v":0},{"$f":"ALL_C!F162","v":0},{"$f":"ALL_C!G162","v":0},{"$f":"ALL_C!H162","v":0},{"$f":"ALL_C!I162","v":0},{"$f":"ALL_C!J162","v":0},null,null,null,null,null,null,null,null,null,null,null,null,null,""]
[1,null,20,20,{"$f":"IF(ALL_C!C163=\"\",\"\",ALL_C!C163)","v":""},{"$f":"ALL_C!E163","v":0},{"$f":"ALL_C!F163","v":0},{"$f":"ALL_C!G163","v":0},{"$f":"ALL_C!H163","v":0},{"$f":"ALL_C!I163","v":0},{"$f":"ALL_C!J163","v":0},null,null,null,null,null,null,null,null,null,null,null,null,null,""]
[1,null,20,20,{"$f":"IF(ALL_C!C164=\"\",\"\",ALL_C!C164)","v":""},{"$f":"ALL_C!E164","v":0},{"$f":"ALL_C!F164","v":0},{"$f":"ALL_C!G164","v":0},{"$f":"ALL_C!H164","v":0},{"$f":"ALL_C!I164","v":0},{"$f":"ALL_C!J164","v":0},null,null,null,null,null,null,null,null,null,null,null,null,null,""]
[1,null,20,20,{"$f":"IF(ALL_C!C165=\"\",\"\",ALL_C!C165)","v":""},{"$f":"ALL_C!E165","v":0},{"$f":"ALL_C!F165","v":0},{"$f":"ALL_C!G165","v":0},{"$f":"ALL_C!H165","v":0},{"$f":"ALL_C!I165","v":0},{"$f":"ALL_C!J165","v":0},null,null,null,null,null,null,null,null,null,null,null,null,null,""]
[1,null,20,20,{"$f":"IF(ALL_C!C166=\"\",\"\",ALL_C!C166)","v":""},{"$f":"ALL_C!E166","v":0},{"$f":"ALL_C!F166","v":0},{"$f":"ALL_C!G166","v":0},{"$f":"ALL_C!H166","v":0},{"$f":"ALL_C!I166","v":0},{"$f":"ALL_C!J166","v":0},null,null,null,null,null,null,null,null,null,null,null,null,null,""]
[1,null,20,20,{"$f":"IF(ALL_C!C167=\"\",\"\",ALL_C!C167)","v":""},{"$f":"ALL_C!E167","v":0},{"$f":"ALL_C!F167","v":0},{"$f":"ALL_C!G167","v":0},{"$f":"ALL_C!H167","v":0},{"$f":"ALL_C!I167","v":0},{"$f":"ALL_C!J167","v":0},null,null,null,null,null,null,null,null,null,null,null,null,null,""]
[1,null,20,20,{"$f":"IF(ALL_C!C168=\"\",\"\",ALL_C!C168)","v":""},{"$f":"ALL_C!E168","v":0},{"$f":"ALL_C!F168","v":0},{"$f":"ALL_C!G168","v":0},{"$f":"ALL_C!H168","v":0},{"$f":"ALL_C!I168","v":0},{"$f":"ALL_C!J168","v":0},null,null,null,null,null,null,null,null,null,null,null,null,null,""]
[1,null,20,20,{"$f":"IF(ALL_C!C169=\"\",\"\",ALL_C!C169)","v":""},{"$f":"ALL_C!E169","v":0},{"$f":"ALL_C!F169","v":0},{"$f":"ALL_C!G169","v":0},{"$f":"ALL_C!H169","v":0},{"$f":"ALL_C!I169","v":0},{"$f":"ALL_C!J169","v":0},null,null,null,null,null,null,null,null,null,null,null,null,null,""]
[1,null,20,20,{"$f":"IF(ALL_C!C170=\"\",\"\",ALL_C!C170)","v":""},{"$f":"ALL_C!E170","v":0},{"$f":"ALL_C!F170","v":0},{"$f":"ALL_C!G170","v":0},{"$f":"ALL_C!H170","v":0},{"$f":"ALL_C!I170","v":0},{"$f":"ALL_C!J170","v":0},null,null,null,null,null,null,null,null,null,null,null,null,null,""]
[1,null,20,20,{"$f":"IF(ALL_C!C171=\"\",\"\",ALL_C!C171)","v":""},{"$f":"ALL_C!E171","v":0},{"$f":"ALL_C!F171","v":0},{"$f":"ALL_C!G171","v":0},{"$f":"ALL_C!H171","v":0},{"$f":"ALL_C!I171","v":0},{"$f":"ALL_C!J171","v":0},null,null,null,null,null,null,null,null,null,null,null,null,null,""]
[1,null,20,30,{"$f":"IF(ALL_C!C176=\"\",\"\",ALL_C!C176)","v":""},{"$f":"ALL_C!E176","v":0},{"$f":"ALL_C!F176","v":0},{"$f":"ALL_C!G176","v":0},{"$f":"ALL_C!H176","v":0},{"$f":"ALL_C!I176","v":0},{"$f":"ALL_C!J176","v":0},null,null,null,null,null,null,null,null,null,null,null,null,null,""]
[1,null,20,30,{"$f":"IF(ALL_C!C177=\"\",\"\",ALL_C!C177)","v":""},{"$f":"ALL_C!E177","v":0},{"$f":"ALL_C!F177","v":0},{"$f":"ALL_C!G177","v":0},{"$f":"ALL_C!H177","v":0},{"$f":"ALL_C!I177","v":0},{"$f":"ALL_C!J177","v":0},null,null,null,null,null,null,null,null,null,null,null,null,null,""]
[1,null,20,30,{"$f":"IF(ALL_C!C178=\"\",\"\",ALL_C!C178)","v":""},{"$f":"ALL_C!E178","v":0},{"$f":"ALL_C!F178","v":0},{"$f":"ALL_C!G178","v":0},{"$f":"ALL_C!H178","v":0},{"$f":"ALL_C!I178","v":0},{"$f":"ALL_C!J178","v":0},null,null,null,null,null,null,null,null,null,null,null,null,null,""]
[1,null,20,30,{"$f":"IF(ALL_C!C179=\"\",\"\",ALL_C!C179)","v":""},{"$f":"ALL_C!E179","v":0},{"$f":"ALL_C!F179","v":0},{"$f":"ALL_C!G179","v":0},{"$f":"ALL_C!H179","v":0},{"$f":"ALL_C!I179","v":0},{"$f":"ALL_C!J179","v":0},null,null,null,null,null,null,null,null,null,null,null,null,null,""]
[1,null,20,30,{"$f":"IF(ALL_C!C180=\"\",\"\",ALL_C!C180)","v":""},{"$f":"ALL_C!E180","v":0},{"$f":"ALL_C!F180","v":0},{"$f":"ALL_C!G180","v":0},{"$f":"ALL_C!H180","v":0},{"$f":"ALL_C!I180","v":0},{"$f":"ALL_C!J180","v":0},null,null,null,null,null,null,null,null,null,null,null,null,null,""]
[1,null,20,30,{"$f":"IF(ALL_C!C181=\"\",\"\",ALL_C!C181)","v":""},{"$f":"ALL_C!E181","v":0},{"$f":"ALL_C!F181","v":0},{"$f":"ALL_C!G181","v":0},{"$f":"ALL_C!H181","v":0},{"$f":"ALL_C!I181","v":0},{"$f":"ALL_C!J181","v":0},null,null,null,null,null,null,null,null,null,null,null,null,null,""]
[1,null,20,30,{"$f":"IF(ALL_C!C182=\"\",\"\",ALL_C!C182)","v":""},{"$f":"ALL_C!E182","v":0},{"$f":"ALL_C!F182","v":0},{"$f":"ALL_C!G182","v":0},{"$f":"ALL_C!H182","v":0},{"$f":"ALL_C!I182","v":0},{"$f":"ALL_C!J182","v":0},null,null,null,null,null,null,null,null,null,null,null,null,null,""]
[1,null,20,30,{"$f":"IF(ALL_C!C183=\"\",\"\",ALL_C!C183)","v":""},{"$f":"ALL_C!E183","v":0},{"$f":"ALL_C!F183","v":0},{"$f":"ALL_C!G183","v":0},{"$f":"ALL_C!H183","v":0},{"$f":"ALL_C!I183","v":0},{"$f":"ALL_C!J183","v":0},null,null,null,null,null,null,null,null,null,null,null,null,null,""]
[1,null,20,30,{"$f":"IF(ALL_C!C184=\"\",\"\",ALL_C!C184)","v":""},{"$f":"ALL_C!E184","v":0},{"$f":"ALL_C!F184","v":0},{"$f":"ALL_C!G184","v":0},{"$f":"ALL_C!H184","v":0},{"$f":"ALL_C!I184","v":0},{"$f":"ALL_C!J184","v":0},null,null,null,null,null,null,null,null,null,null,null,null,null,""]
[1,null,20,30,{"$f":"IF(ALL_C!C185=\"\",\"\",ALL_C!C185)","v":""},{"$f":"ALL_C!E185","v":0},{"$f":"ALL_C!F185","v":0},{"$f":"ALL_C!G185","v":0},{"$f":"ALL_C!H185","v":0},{"$f":"ALL_C!I185","v":0},{"$f":"ALL_C!J185","v":0},null,null,null,null,null,null,null,null,null,null,null,null,null,""]
[1,null,20,30,{"$f":"IF(ALL_C!C186=\"\",\"\",ALL_C!C186)","v":""},{"$f":"ALL_C!E186","v":0},{"$f":"ALL_C!F186","v":0},{"$f":"ALL_C!G186","v":0},{"$f":"ALL_C!H186","v":0},{"$f":"ALL_C!I186","v":0},{"$f":"ALL_C!J186","v":0},null,null,null,null,null,null,null,null,null,null,null,null,null,""]
[1,null,20,30,{"$f":"IF(ALL_C!C187=\"\",\"\",ALL_C!C187)","v":""},{"$f":"ALL_C!E187","v":0},{"$f":"ALL_C!F187","v":0},{"$f":"ALL_C!G187","v":0},{"$f":"ALL_C!H187","v":0},{"$f":"ALL_C!I187","v":0},{"$f":"ALL_C!J187","v":0},null,null,null,null,null,null,null,null,null,null,null,null,null,""]
[1,null,20,30,{"$f":"IF(ALL_C!C188=\"\",\"\",ALL_C!C188)","v":""},{"$f":"ALL_C!E188","v":0},{"$f":"ALL_C!F188","v":0},{"$f":"ALL_C!G188","v":0},{"$f":"ALL_C!H188","v":0},{"$f":"ALL_C!I188","v":0},{"$f":"ALL_C!J188","v":0},null,null,null,null,null,null,null,null,null,null,null,null,null,""]
[1,null,20,30,{"$f":"IF(ALL_C!C189=\"\",\"\",ALL_C!C189)","v":""},{"$f":"ALL_C!E189","v":0},{"$f":"ALL_C!F189","v":0},{"$f":"ALL_C!G189","v":0},{"$f":"ALL_C!H189","v":0},{"$f":"ALL_C!I189","v":0},{"$f":"ALL_C!J189","v":0},null,null,null,null,null,null,null,null,null,null,null,null,null,""]
[1,null,20,30,{"$f":"IF(ALL_C!C190=\"\",\"\",ALL_C!C190)","v":""},{"$f":"ALL_C!E190","v":0},{"$f":"ALL_C!F190","v":0},{"$f":"ALL_C!G190","v":0},{"$f":"ALL_C!H190","v":0},{"$f":"ALL_C!I190","v":0},{"$f":"ALL_C!J190","v":0},null,null,null,null,null,null,null,null,null,null,null,null,null,""]
[1,null,20,30,{"$f":"IF(ALL_C!C191=\"\",\"\",ALL_C!C191)","v":""},{"$f":"ALL_C!E191","v":0},{"$f":"ALL_C!F191","v":0},{"$f":"ALL_C!G191","v":0},{"$f":"ALL_C!H191","v":0},{"$f":"ALL_C!I191","v":0},{"$f":"ALL_C!J191","v":0},null,null,null,null,null,null,null,null,null,null,null,null,null,""]
[1,null,20,30,{"$f":"IF(ALL_C!C192=\"\",\"\",ALL_C!C192)","v":""},{"$f":"ALL_C!E192","v":0},{"$f":"ALL_C!F192","v":0},{"$f":"ALL_C!G192","v":0},{"$f":"ALL_C!H192","v":0},{"$f":"ALL_C!I192","v":0},{"$f":"ALL_C!J192","v":0},null,null,null,null,null,null,null,null,null,null,null,null,null,""]
[1,null,20,30,{"$f":"IF(ALL_C!C193=\"\",\"\",ALL_C!C193)","v":""},{"$f":"ALL_C!E193","v":0},{"$f":"ALL_C!F193","v":0},{"$f":"ALL_C!G193","v":0},{"$f":"ALL_C!H193","v":0},{"$f":"ALL_C!I193","v":0},{"$f":"ALL_C!J193","v":0},null,null,null,null,null,null,null,null,null,null,null,null,null,""]
[1,null,20,30,{"$f":"IF(ALL_C!C194=\"\",\"\",ALL_C!C194)","v":""},{"$f":"ALL_C!E194","v":0},{"$f":"ALL_C!F194","v":0},{"$f":"ALL_C!G194","v":0},{"$f":"ALL_C!H194","v":0},{"$f":"ALL_C!I194","v":0},{"$f":"ALL_C!J194","v":0},null,null,null,null,null,null,null,null,null,null,null,null,null,""]
[1,null,20,30,{"$f":"IF(ALL_C!C195=\"\",\"\",ALL_C!C195)","v":""},{"$f":"ALL_C!E195","v":0},{"$f":"ALL_C!F195","v":0},{"$f":"ALL_C!G195","v":0},{"$f":"ALL_C!H195","v":0},{"$f":"ALL_C!I195","v":0},{"$f":"ALL_C!J195","v":0},null,null,null,null,null,null,null,null,null,null,null,null,null,""]
[1,null,20,30,{"$f":"IF(ALL_C!C196=\"\",\"\",ALL_C!C196)","v":""},{"$f":"ALL_C!E196","v":0},{"$f":"ALL_C!F196","v":0},{"$f":"ALL_C!G196","v":0},{"$f":"ALL_C!H196","v":0},{"$f":"ALL_C!I196","v":0},{"$f":"ALL_C!J196","v":0},null,null,null,null,null,null,null,null,null,null,null,null,null,""]
[1,null,20,30,{"$f":"IF(ALL_C!C197=\"\",\"\",ALL_C!C197)","v":""},{"$f":"ALL_C!E197","v":0},{"$f":"ALL_C!F197","v":0},{"$f":"ALL_C!G197","v":0},{"$f":"ALL_C!H197","v":0},{"$f":"ALL_C!I197","v":0},{"$f":"ALL_C!J197","v":0},null,null,null,null,null,null,null,null,null,null,null,null,null,""]
[1,null,20,30,{"$f":"IF(ALL_C!C198=\"\",\"\",ALL_C!C198)","v":""},{"$f":"ALL_C!E198","v":0},{"$f":"ALL_C!F198","v":0},{"$f":"ALL_C!G198","v":0},{"$f":"ALL_C!H198","v":0},{"$f":"ALL_C!I198","v":0},{"$f":"ALL_C!J198","v":0},null,null,null,null,null,null,null,null,null,null,null,null,null,""]
[1,null,20,30,{"$f":"IF(ALL_C!C199=\"\",\"\",ALL_C!C199)","v":""},{"$f":"ALL_C!E199","v":0},{"$f":"ALL_C!F199","v":0},{"$f":"ALL_C!G199","v":0},{"$f":"ALL_C!H199","v":0},{"$f":"ALL_C!I199","v":0},{"$f":"ALL_C!J199","v":0},null,null,null,null,null,null,null,null,null,null,null,null,null,""]
[1,null,20,30,{"$f":"IF(ALL_C!C200=\"\",\"\",ALL_C!C200)","v":""},{"$f":"ALL_C!E200","v":0},{"$f":"ALL_C!F200","v":0},{"$f":"ALL_C!G200","v":0},{"$f":"ALL_C!H200","v":0},{"$f":"ALL_C!I200","v":0},{"$f":"ALL_C!J200","v":0},null,null,null,null,null,null,null,null,null,null,null,null,null,""]
[1,null,20,30,{"$f":"IF(ALL_C!C201=\"\",\"\",ALL_C!C201)","v":""},{"$f":"ALL_C!E201","v":0},{"$f":"ALL_C!F201","v":0},{"$f":"ALL_C!G201","v":0},{"$f":"ALL_C!H201","v":0},{"$f":"ALL_C!I201","v":0},{"$f":"ALL_C!J201","v":0},null,null,null,null,null,null,null,null,null,null,null,null,null,""]
[1,null,20,30,{"$f":"IF(ALL_C!C202=\"\",\"\",ALL_C!C202)","v":""},{"$f":"ALL_C!E202","v":0},{"$f":"ALL_C!F202","v":0},{"$f":"ALL_C!G202","v":0},{"$f":"ALL_C!H202","v":0},{"$f":"ALL_C!I202","v":0},{"$f":"ALL_C!J202","v":0},null,null,null,null,null,null,null,null,null,null,null,null,null,""]
[1,null,20,30,{"$f":"IF(ALL_C!C203=\"\",\"\",ALL_C!C203)","v":""},{"$f":"ALL_C!E203","v":0},{"$f":"ALL_C!F203","v":0},{"$f":"ALL_C!G203","v":0},{"$f":"ALL_C!H203","v":0},{"$f":"ALL_C!I203","v":0},{"$f":"ALL_C!J203","v":0},null,null,null,null,null,null,null,null,null,null,null,null,null,""]
[1,null,20,30,{"$f":"IF(ALL_C!C204=\"\",\"\",ALL_C!C204)","v":""},{"$f":"ALL_C!E204","v":0},{"$f":"ALL_C!F204","v":0},{"$f":"ALL_C!G204","v":0},{"$f":"ALL_C!H204","v":0},{"$f":"ALL_C!I204","v":0},{"$f":"ALL_C!J204","v":0},null,null,null,null,null,null,null,null,null,null,null,null,null,""]
[1,null,20,30,{"$f":"IF(ALL_C!C205=\"\",\"\",ALL_C!C205)","v":""},{"$f":"ALL_C!E205","v":0},{"$f":"ALL_C!F205","v":0},{"$f":"ALL_C!G205","v":0},{"$f":"ALL_C!H205","v":0},{"$f":"ALL_C!I205","v":0},{"$f":"ALL_C!J205","v":0},null,null,null,null,null,null,null,null,null,null,null,null,null,{"$f":"IFERROR(E131,\"#ERR\")","v":""}]
[1,null,20,30,{"$f":"IF(ALL_C!C206=\"\",\"\",ALL_C!C206)","v":""},{"$f":"ALL_C!E206","v":0},{"$f":"ALL_C!F206","v":0},{"$f":"ALL_C!G206","v":0},{"$f":"ALL_C!H206","v":0},{"$f":"ALL_C!I206","v":0},{"$f":"ALL_C!J206","v":0},null,null,null,null,null,null,null,null,null,null,null,null,null,""]
[1,null,20,30,{"$f":"IF(ALL_C!C207=\"\",\"\",ALL_C!C207)","v":""},{"$f":"ALL_C!E207","v":0},{"$f":"ALL_C!F207","v":0},{"$f":"ALL_C!G207","v":0},{"$f":"ALL_C!H207","v":0},{"$f":"ALL_C!I207","v":0},{"$f":"ALL_C!J207","v":0},null,null,null,null,null,null,null,null,null,null,null,null,null,""]
[1,null,20,30,{"$f":"IF(ALL_C!C208=\"\",\"\",ALL_C!C208)","v":""},{"$f":"ALL_C!E208","v":0},{"$f":"ALL_C!F208","v":0},{"$f":"ALL_C!G208","v":0},{"$f":"ALL_C!H208","v":0},{"$f":"ALL_C!I208","v":0},{"$f":"ALL_C!J208","v":0},null,null,null,null,null,null,null,null,null,null,null,null,null,""]
[1,null,20,30,{"$f":"IF(ALL_C!C209=\"\",\"\",ALL_C!C209)","v":""},{"$f":"ALL_C!E209","v":0},{"$f":"ALL_C!F209","v":0},{"$f":"ALL_C!G209","v":0},{"$f":"ALL_C!H209","v":0},{"$f":"ALL_C!I209","v":0},{"$f":"ALL_C!J209","v":0},null,null,null,null,null,null,null,null,null,null,null,null,null,""]
[1,null,20,30,{"$f":"IF(ALL_C!C210=\"\",\"\",ALL_C!C210)","v":""},{"$f":"ALL_C!E210","v":0},{"$f":"ALL_C!F210","v":0},{"$f":"ALL_C!G210","v":0},{"$f":"ALL_C!H210","v":0},{"$f":"ALL_C!I210","v":0},{"$f":"ALL_C!J210","v":0},null,null,null,null,null,null,null,null,null,null,null,null,null,""]
[1,null,20,30,{"$f":"IF(ALL_C!C211=\"\",\"\",ALL_C!C211)","v":""},{"$f":"ALL_C!E211","v":0},{"$f":"ALL_C!F211","v":0},{"$f":"ALL_C!G211","v":0},{"$f":"ALL_C!H211","v":0},{"$f":"ALL_C!I211","v":0},{"$f":"ALL_C!J211","v":0},null,null,null,null,null,null,null,null,null,null,null,null,null,""]
[1,null,20,30,{"$f":"IF(ALL_C!C212=\"\",\"\",ALL_C!C212)","v":""},{"$f":"ALL_C!E212","v":0},{"$f":"ALL_C!F212","v":0},{"$f":"ALL_C!G212","v":0},{"$f":"ALL_C!H212","v":0},{"$f":"ALL_C!I212","v":0},{"$f":"ALL_C!J212","v":0},null,null,null,null,null,null,null,null,null,null,null,null,null,""]
[1,null,20,30,{"$f":"IF(ALL_C!C213=\"\",\"\",ALL_C!C213)","v":""},{"$f":"ALL_C!E213","v":0},{"$f":"ALL_C!F213","v":0},{"$f":"ALL_C!G213","v":0},{"$f":"ALL_C!H213","v":0},{"$f":"ALL_C!I213","v":0},{"$f":"ALL_C!J213","v":0},null,null,null,null,null,null,null,null,null,null,null,null,null,""]
[1,null,20,30,{"$f":"IF(ALL_C!C214=\"\",\"\",ALL_C!C214)","v":""},{"$f":"ALL_C!E214","v":0},{"$f":"ALL_C!F214","v":0},{"$f":"ALL_C!G214","v":0},{"$f":"ALL_C!H214","v":0},{"$f":"ALL_C!I214","v":0},{"$f":"ALL_C!J214","v":0},null,null,null,null,null,null,null,null,null,null,null,null,null,""]
[1,null,20,30,{"$f":"IF(ALL_C!C215=\"\",\"\",ALL_C!C215)","v":""},{"$f":"ALL_C!E215","v":0},{"$f":"ALL_C!F215","v":0},{"$f":"ALL_C!G215","v":0},{"$f":"ALL_C!H215","v":0},{"$f":"ALL_C!I215","v":0},{"$f":"ALL_C!J215","v":0},null,null,null,null,null,null,null,null,null,null,null,null,null,""]
[1,null,20,30,{"$f":"IF(ALL_C!C216=\"\",\"\",ALL_C!C216)","v":""},{"$f":"ALL_C!E216","v":0},{"$f":"ALL_C!F216","v":0},{"$f":"ALL_C!G216","v":0},{"$f":"ALL_C!H216","v":0},{"$f":"ALL_C!I216","v":0},{"$f":"ALL_C!J216","v":0},null,null,null,null,null,null,null,null,null,null,null,null,null,""]
[1,null,20,30,{"$f":"IF(ALL_C!C217=\"\",\"\",ALL_C!C217)","v":""},{"$f":"ALL_C!E217","v":0},{"$f":"ALL_C!F217","v":0},{"$f":"ALL_C!G217","v":0},{"$f":"ALL_C!H217","v":0},{"$f":"ALL_C!I217","v":0},{"$f":"ALL_C!J217","v":0},null,null,null,null,null,null,null,null,null,null,null,null,null,""]
[1,null,20,30,{"$f":"IF(ALL_C!C218=\"\",\"\",ALL_C!C218)","v":""},{"$f":"ALL_C!E218","v":0},{"$f":"ALL_C!F218","v":0},{"$f":"ALL_C!G218","v":0},{"$f":"ALL_C!H218","v":0},{"$f":"ALL_C!I218","v":0},{"$f":"ALL_C!J218","v":0},null,null,null,null,null,null,null,null,null,null,null,null,null,""]
[1,null,20,30,{"$f":"IF(ALL_C!C219=\"\",\"\",ALL_C!C219)","v":""},{"$f":"ALL_C!E219","v":0},{"$f":"ALL_C!F219","v":0},{"$f":"ALL_C!G219","v":0},{"$f":"ALL_C!H219","v":0},{"$f":"ALL_C!I219","v":0},{"$f":"ALL_C!J219","v":0},null,null,null,null,null,null,null,null,null,null,null,null,null,""]
[1,null,20,30,{"$f":"IF(ALL_C!C220=\"\",\"\",ALL_C!C220)","v":""},{"$f":"ALL_C!E220","v":0},{"$f":"ALL_C!F220","v":0},{"$f":"ALL_C!G220","v":0},{"$f":"ALL_C!H220","v":0},{"$f":"ALL_C!I220","v":0},{"$f":"ALL_C!J220","v":0},null,null,null,null,null,null,null,null,null,null,null,null,null,""]
[1,null,20,30,{"$f":"IF(ALL_C!C221=\"\",\"\",ALL_C!C221)","v":""},{"$f":"ALL_C!E221","v":0},{"$f":"ALL_C!F221","v":0},{"$f":"ALL_C!G221","v":0},{"$f":"ALL_C!H221","v":0},{"$f":"ALL_C!I221","v":0},{"$f":"ALL_C!J221","v":0},null,null,null,null,null,null,null,null,null,null,null,null,null,""]
[1,null,20,30,{"$f":"IF(ALL_C!C222=\"\",\"\",ALL_C!C222)","v":""},{"$f":"ALL_C!E222","v":0},{"$f":"ALL_C!F222","v":0},{"$f":"ALL_C!G222","v":0},{"$f":"ALL_C!H222","v":0},{"$f":"ALL_C!I222","v":0},{"$f":"ALL_C!J222","v":0},null,null,null,null,null,null,null,null,null,null,null,null,null,""]
[1,null,20,30,{"$f":"IF(ALL_C!C223=\"\",\"\",ALL_C!C223)","v":""},{"$f":"ALL_C!E223","v":0},{"$f":"ALL_C!F223","v":0},{"$f":"ALL_C!G223","v":0},{"$f":"ALL_C!H223","v":0},{"$f":"ALL_C!I223","v":0},{"$f":"ALL_C!J223","v":0},null,null,null,null,null,null,null,null,null,null,null,null,null,""]
[1,null,20,30,{"$f":"IF(ALL_C!C224=\"\",\"\",ALL_C!C224)","v":""},{"$f":"ALL_C!E224","v":0},{"$f":"ALL_C!F224","v":0},{"$f":"ALL_C!G224","v":0},{"$f":"ALL_C!H224","v":0},{"$f":"ALL_C!I224","v":0},{"$f":"ALL_C!J224","v":0},null,null,null,null,null,null,null,null,null,null,null,null,null,""]
[1,null,20,30,{"$f":"IF(ALL_C!C225=\"\",\"\",ALL_C!C225)","v":""},{"$f":"ALL_C!E225","v":0},{"$f":"ALL_C!F225","v":0},{"$f":"ALL_C!G225","v":0},{"$f":"ALL_C!H225","v":0},{"$f":"ALL_C!I225","v":0},{"$f":"ALL_C!J225","v":0},null,null,null,null,null,null,null,null,null,null,null,null,null,""]
[1,null,30,10,{"$f":"IF(ALL_C!C240=\"\",\"\",ALL_C!C240)","v":""},{"$f":"ALL_C!E240","v":0},{"$f":"ALL_C!F240","v":0},{"$f":"ALL_C!G240","v":0},{"$f":"ALL_C!H240","v":0},{"$f":"ALL_C!I240","v":0},{"$f":"ALL_C!J240","v":0},null,null,null,null,null,null,null,null,null,null,null,null,null,""]
[1,null,30,10,{"$f":"IF(ALL_C!C241=\"\",\"\",ALL_C!C241)","v":""},{"$f":"ALL_C!E241","v":0},{"$f":"ALL_C!F241","v":0},{"$f":"ALL_C!G241","v":0},{"$f":"ALL_C!H241","v":0},{"$f":"ALL_C!I241","v":0},{"$f":"ALL_C!J241","v":0},null,null,null,null,null,null,null,null,null,null,null,null,null,""]
[1,null,30,10,{"$f":"IF(ALL_C!C242=\"\",\"\",ALL_C!C242)","v":""},{"$f":"ALL_C!E242","v":0},{"$f":"ALL_C!F242","v":0},{"$f":"ALL_C!G242","v":0},{"$f":"ALL_C!H242","v":0},{"$f":"ALL_C!I242","v":0},{"$f":"ALL_C!J242","v":0},null,null,null,null,null,null,null,null,null,null,null,null,null,""]
[1,null,30,10,{"$f":"IF(ALL_C!C243=\"\",\"\",ALL_C!C243)","v":""},{"$f":"ALL_C!E243","v":0},{"$f":"ALL_C!F243","v":0},{"$f":"ALL_C!G243","v":0},{"$f":"ALL_C!H243","v":0},{"$f":"ALL_C!I243","v":0},{"$f":"ALL_C!J243","v":0},null,null,null,null,null,null,null,null,null,null,null,null,null,""]
[1,null,30,10,{"$f":"IF(ALL_C!C244=\"\",\"\",ALL_C!C244)","v":""},{"$f":"ALL_C!E244","v":0},{"$f":"ALL_C!F244","v":0},{"$f":"ALL_C!G244","v":0},{"$f":"ALL_C!H244","v":0},{"$f":"ALL_C!I244","v":0},{"$f":"ALL_C!J244","v":0},null,null,null,null,null,null,null,null,null,null,null,null,null,""]
[1,null,30,10,{"$f":"IF(ALL_C!C245=\"\",\"\",ALL_C!C245)","v":""},{"$f":"ALL_C!E245","v":0},{"$f":"ALL_C!F245","v":0},{"$f":"ALL_C!G245","v":0},{"$f":"ALL_C!H245","v":0},{"$f":"ALL_C!I245","v":0},{"$f":"ALL_C!J245","v":0},null,null,null,null,null,null,null,null,null,null,null,null,null,""]
[1,null,30,10,{"$f":"IF(ALL_C!C246=\"\",\"\",ALL_C!C246)","v":""},{"$f":"ALL_C!E246","v":0},{"$f":"ALL_C!F246","v":0},{"$f":"ALL_C!G246","v":0},{"$f":"ALL_C!H246","v":0},{"$f":"ALL_C!I246","v":0},{"$f":"ALL_C!J246","v":0},null,null,null,null,null,null,null,null,null,null,null,null,null,""]
[1,null,30,10,{"$f":"IF(ALL_C!C247=\"\",\"\",ALL_C!C247)","v":""},{"$f":"ALL_C!E247","v":0},{"$f":"ALL_C!F247","v":0},{"$f":"ALL_C!G247","v":0},{"$f":"ALL_C!H247","v":0},{"$f":"ALL_C!I247","v":0},{"$f":"ALL_C!J247","v":0},null,null,null,null,null,null,null,null,null,null,null,null,null,""]
[1,null,30,10,{"$f":"IF(ALL_C!C248=\"\",\"\",ALL_C!C248)","v":""},{"$f":"ALL_C!E248","v":0},{"$f":"ALL_C!F248","v":0},{"$f":"ALL_C!G248","v":0},{"$f":"ALL_C!H248","v":0},{"$f":"ALL_C!I248","v":0},{"$f":"ALL_C!J248","v":0},null,null,null,null,null,null,null,null,null,null,null,null,null,""]
[1,null,30,10,{"$f":"IF(ALL_C!C249=\"\",\"\",ALL_C!C249)","v":""},{"$f":"ALL_C!E249","v":0},{"$f":"ALL_C!F249","v":0},{"$f":"ALL_C!G249","v":0},{"$f":"ALL_C!H249","v":0},{"$f":"ALL_C!I249","v":0},{"$f":"ALL_C!J249","v":0},null,null,null,null,null,null,null,null,null,null,null,null,null,""]
[1,null,30,10,{"$f":"IF(ALL_C!C250=\"\",\"\",ALL_C!C250)","v":""},{"$f":"ALL_C!E250","v":0},{"$f":"ALL_C!F250","v":0},{"$f":"ALL_C!G250","v":0},{"$f":"ALL_C!H250","v":0},{"$f":"ALL_C!I250","v":0},{"$f":"ALL_C!J250","v":0},null,null,null,null,null,null,null,null,null,null,null,null,null,""]
[1,null,30,10,{"$f":"IF(ALL_C!C251=\"\",\"\",ALL_C!C251)","v":""},{"$f":"ALL_C!E251","v":0},{"$f":"ALL_C!F251","v":0},{"$f":"ALL_C!G251","v":0},{"$f":"ALL_C!H251","v":0},{"$f":"ALL_C!I251","v":0},{"$f":"ALL_C!J251","v":0},null,null,null,null,null,null,null,null,null,null,null,null,null,""]
[1,null,30,10,{"$f":"IF(ALL_C!C252=\"\",\"\",ALL_C!C252)","v":""},{"$f":"ALL_C!E252","v":0},{"$f":"ALL_C!F252","v":0},{"$f":"ALL_C!G252","v":0},{"$f":"ALL_C!H252","v":0},{"$f":"ALL_C!I252","v":0},{"$f":"ALL_C!J252","v":0},null,null,null,null,null,null,null,null,null,null,null,null,null,""]
[1,null,30,10,{"$f":"IF(ALL_C!C253=\"\",\"\",ALL_C!C253)","v":""},{"$f":"ALL_C!E253","v":0},{"$f":"ALL_C!F253","v":0},{"$f":"ALL_C!G253","v":0},{"$f":"ALL_C!H253","v":0},{"$f":"ALL_C!I253","v":0},{"$f":"ALL_C!J253","v":0},null,null,null,null,null,null,null,null,null,null,null,null,null,""]
[1,null,30,10,{"$f":"IF(ALL_C!C254=\"\",\"\",ALL_C!C254)","v":""},{"$f":"ALL_C!E254","v":0},{"$f":"ALL_C!F254","v":0},{"$f":"ALL_C!G254","v":0},{"$f":"ALL_C!H254","v":0},{"$f":"ALL_C!I254","v":0},{"$f":"ALL_C!J254","v":0},null,null,null,null,null,null,null,null,null,null,null,null,null,""]
[1,null,30,10,{"$f":"IF(ALL_C!C255=\"\",\"\",ALL_C!C255)","v":""},{"$f":"ALL_C!E255","v":0},{"$f":"ALL_C!F255","v":0},{"$f":"ALL_C!G255","v":0},{"$f":"ALL_C!H255","v":0},{"$f":"ALL_C!I255","v":0},{"$f":"ALL_C!J255","v":0},null,null,null,null,null,null,null,null,null,null,null,null,null,""]
[1,null,30,10,{"$f":"IF(ALL_C!C256=\"\",\"\",ALL_C!C256)","v":""},{"$f":"ALL_C!E256","v":0},{"$f":"ALL_C!F256","v":0},{"$f":"ALL_C!G256","v":0},{"$f":"ALL_C!H256","v":0},{"$f":"ALL_C!I256","v":0},{"$f":"ALL_C!J256","v":0},null,null,null,null,null,null,null,null,null,null,null,null,null,""]
[1,null,30,10,{"$f":"IF(ALL_C!C257=\"\",\"\",ALL_C!C257)","v":""},{"$f":"ALL_C!E257","v":0},{"$f":"ALL_C!F257","v":0},{"$f":"ALL_C!G257","v":0},{"$f":"ALL_C!H257","v":0},{"$f":"ALL_C!I257","v":0},{"$f":"ALL_C!J257","v":0},null,null,null,null,null,null,null,null,null,null,null,null,null,""]
[1,null,30,10,{"$f":"IF(ALL_C!C258=\"\",\"\",ALL_C!C258)","v":""},{"$f":"ALL_C!E258","v":0},{"$f":"ALL_C!F258","v":0},{"$f":"ALL_C!G258","v":0},{"$f":"ALL_C!H258","v":0},{"$f":"ALL_C!I258","v":0},{"$f":"ALL_C!J258","v":0},null,null,null,null,null,null,null,null,null,null,null,null,null,""]
[1,null,30,10,{"$f":"IF(ALL_C!C259=\"\",\"\",ALL_C!C259)","v":""},{"$f":"ALL_C!E259","v":0},{"$f":"ALL_C!F259","v":0},{"$f":"ALL_C!G259","v":0},{"$f":"ALL_C!H259","v":0},{"$f":"ALL_C!I259","v":0},{"$f":"ALL_C!J259","v":0},null,null,null,null,null,null,null,null,null,null,null,null,null,""]
[1,null,30,10,{"$f":"IF(ALL_C!C260=\"\",\"\",ALL_C!C260)","v":""},{"$f":"ALL_C!E260","v":0},{"$f":"ALL_C!F260","v":0},{"$f":"ALL_C!G260","v":0},{"$f":"ALL_C!H260","v":0},{"$f":"ALL_C!I260","v":0},{"$f":"ALL_C!J260","v":0},null,null,null,null,null,null,null,null,null,null,null,null,null,""]
[1,null,30,10,{"$f":"IF(ALL_C!C261=\"\",\"\",ALL_C!C261)","v":""},{"$f":"ALL_C!E261","v":0},{"$f":"ALL_C!F261","v":0},{"$f":"ALL_C!G261","v":0},{"$f":"ALL_C!H261","v":0},{"$f":"ALL_C!I261","v":0},{"$f":"ALL_C!J261","v":0},null,null,null,null,null,null,null,null,null,null,null,null,null,""]
[1,null,30,10,{"$f":"IF(ALL_C!C262=\"\",\"\",ALL_C!C262)","v":""},{"$f":"ALL_C!E262","v":0},{"$f":"ALL_C!F262","v":0},{"$f":"ALL_C!G262","v":0},{"$f":"ALL_C!H262","v":0},{"$f":"ALL_C!I262","v":0},{"$f":"ALL_C!J262","v":0},null,null,null,null,null,null,null,null,null,null,null,null,null,""]
[1,null,30,10,{"$f":"IF(ALL_C!C263=\"\",\"\",ALL_C!C263)","v":""},{"$f":"ALL_C!E263","v":0},{"$f":"ALL_C!F263","v":0},{"$f":"ALL_C!G263","v":0},{"$f":"ALL_C!H263","v":0},{"$f":"ALL_C!I263","v":0},{"$f":"ALL_C!J263","v":0},null,null,null,null,null,null,null,null,null,null,null,null,null,""]
[1,null,30,10,{"$f":"IF(ALL_C!C264=\"\",\"\",ALL_C!C264)","v":""},{"$f":"ALL_C!E264","v":0},{"$f":"ALL_C!F264","v":0},{"$f":"ALL_C!G264","v":0},{"$f":"ALL_C!H264","v":0},{"$f":"ALL_C!I264","v":0},{"$f":"ALL_C!J264","v":0},null,null,null,null,null,null,null,null,null,null,null,null,null,""]
[1,null,30,10,{"$f":"IF(ALL_C!C265=\"\",\"\",ALL_C!C265)","v":""},{"$f":"ALL_C!E265","v":0},{"$f":"ALL_C!F265","v":0},{"$f":"ALL_C!G265","v":0},{"$f":"ALL_C!H265","v":0},{"$f":"ALL_C!I265","v":0},{"$f":"ALL_C!J265","v":0},null,null,null,null,null,null,null,null,null,null,null,null,null,""]
[1,null,30,10,{"$f":"IF(ALL_C!C266=\"\",\"\",ALL_C!C266)","v":""},{"$f":"ALL_C!E266","v":0},{"$f":"ALL_C!F266","v":0},{"$f":"ALL_C!G266","v":0},{"$f":"ALL_C!H266","v":0},{"$f":"ALL_C!I266","v":0},{"$f":"ALL_C!J266","v":0},null,null,null,null,null,null,null,null,null,null,null,null,null,""]
[1,null,30,10,{"$f":"IF(ALL_C!C267=\"\",\"\",ALL_C!C267)","v":""},{"$f":"ALL_C!E267","v":0},{"$f":"ALL_C!F267","v":0},{"$f":"ALL_C!G267","v":0},{"$f":"ALL_C!H267","v":0},{"$f":"ALL_C!I267","v":0},{"$f":"ALL_C!J267","v":0},null,null,null,null,null,null,null,null,null,null,null,null,null,""]
[1,null,30,10,{"$f":"IF(ALL_C!C268=\"\",\"\",ALL_C!C268)","v":""},{"$f":"ALL_C!E268","v":0},{"$f":"ALL_C!F268","v":0},{"$f":"ALL_C!G268","v":0},{"$f":"ALL_C!H268","v":0},{"$f":"ALL_C!I268","v":0},{"$f":"ALL_C!J268","v":0},null,null,null,null,null,null,null,null,null,null,null,null,null,""]
[1,null,30,10,{"$f":"IF(ALL_C!C269=\"\",\"\",ALL_C!C269)","v":""},{"$f":"ALL_C!E269","v":0},{"$f":"ALL_C!F269","v":0},{"$f":"ALL_C!G269","v":0},{"$f":"ALL_C!H269","v":0},{"$f":"ALL_C!I269","v":0},{"$f":"ALL_C!J269","v":0},null,null,null,null,null,null,null,null,null,null,null,null,null,""]
[1,null,30,10,{"$f":"IF(ALL_C!C270=\"\",\"\",ALL_C!C270)","v":""},{"$f":"ALL_C!E270","v":0},{"$f":"ALL_C!F270","v":0},{"$f":"ALL_C!G270","v":0},{"$f":"ALL_C!H270","v":0},{"$f":"ALL_C!I270","v":0},{"$f":"ALL_C!J270","v":0},null,null,null,null,null,null,null,null,null,null,null,null,null,""]
[1,null,30,10,{"$f":"IF(ALL_C!C271=\"\",\"\",ALL_C!C271)","v":""},{"$f":"ALL_C!E271","v":0},{"$f":"ALL_C!F271","v":0},{"$f":"ALL_C!G271","v":0},{"$f":"ALL_C!H271","v":0},{"$f":"ALL_C!I271","v":0},{"$f":"ALL_C!J271","v":0},null,null,null,null,null,null,null,null,null,null,null,null,null,""]
[1,null,30,10,{"$f":"IF(ALL_C!C272=\"\",\"\",ALL_C!C272)","v":""},{"$f":"ALL_C!E272","v":0},{"$f":"ALL_C!F272","v":0},{"$f":"ALL_C!G272","v":0},{"$f":"ALL_C!H272","v":0},{"$f":"ALL_C!I272","v":0},{"$f":"ALL_C!J272","v":0},null,null,null,null,null,null,null,null,null,null,null,null,null,""]
[1,null,30,10,{"$f":"IF(ALL_C!C273=\"\",\"\",ALL_C!C273)","v":""},{"$f":"ALL_C!E273","v":0},{"$f":"ALL_C!F273","v":0},{"$f":"ALL_C!G273","v":0},{"$f":"ALL_C!H273","v":0},{"$f":"ALL_C!I273","v":0},{"$f":"ALL_C!J273","v":0},null,null,null,null,null,null,null,null,null,null,null,null,null,""]
[1,null,30,10,{"$f":"IF(ALL_C!C274=\"\",\"\",ALL_C!C274)","v":""},{"$f":"ALL_C!E274","v":0},{"$f":"ALL_C!F274","v":0},{"$f":"ALL_C!G274","v":0},{"$f":"ALL_C!H274","v":0},{"$f":"ALL_C!I274","v":0},{"$f":"ALL_C!J274","v":0},null,null,null,null,null,null,null,null,null,null,null,null,null,""]
[1,null,30,10,{"$f":"IF(ALL_C!C275=\"\",\"\",ALL_C!C275)","v":""},{"$f":"ALL_C!E275","v":0},{"$f":"ALL_C!F275","v":0},{"$f":"ALL_C!G275","v":0},{"$f":"ALL_C!H275","v":0},{"$f":"ALL_C!I275","v":0},{"$f":"ALL_C!J275","v":0},null,null,null,null,null,null,null,null,null,null,null,null,null,""]
[1,null,30,10,{"$f":"IF(ALL_C!C276=\"\",\"\",ALL_C!C276)","v":""},{"$f":"ALL_C!E276","v":0},{"$f":"ALL_C!F276","v":0},{"$f":"ALL_C!G276","v":0},{"$f":"ALL_C!H276","v":0},{"$f":"ALL_C!I276","v":0},{"$f":"ALL_C!J276","v":0},null,null,null,null,null,null,null,null,null,null,null,null,null,""]
[1,null,30,10,{"$f":"IF(ALL_C!C277=\"\",\"\",ALL_C!C277)","v":""},{"$f":"ALL_C!E277","v":0},{"$f":"ALL_C!F277","v":0},{"$f":"ALL_C!G277","v":0},{"$f":"ALL_C!H277","v":0},{"$f":"ALL_C!I277","v":0},{"$f":"ALL_C!J277","v":0},null,null,null,null,null,null,null,null,null,null,null,null,null,""]
[1,null,30,10,{"$f":"IF(ALL_C!C278=\"\",\"\",ALL_C!C278)","v":""},{"$f":"ALL_C!E278","v":0},{"$f":"ALL_C!F278","v":0},{"$f":"ALL_C!G278","v":0},{"$f":"ALL_C!H278","v":0},{"$f":"ALL_C!I278","v":0},{"$f":"ALL_C!J278","v":0},null,null,null,null,null,null,null,null,null,null,null,null,null,""]
[1,null,30,10,{"$f":"IF(ALL_C!C279=\"\",\"\",ALL_C!C279)","v":""},{"$f":"ALL_C!E279","v":0},{"$f":"ALL_C!F279","v":0},{"$f":"ALL_C!G279","v":0},{"$f":"ALL_C!H279","v":0},{"$f":"ALL_C!I279","v":0},{"$f":"ALL_C!J279","v":0},null,null,null,null,null,null,null,null,null,null,null,null,null,""]
[1,null,30,10,{"$f":"IF(ALL_C!C280=\"\",\"\",ALL_C!C280)","v":""},{"$f":"ALL_C!E280","v":0},{"$f":"ALL_C!F280","v":0},{"$f":"ALL_C!G280","v":0},{"$f":"ALL_C!H280","v":0},{"$f":"ALL_C!I280","v":0},{"$f":"ALL_C!J280","v":0},null,null,null,null,null,null,null,null,null,null,null,null,null,""]
[1,null,30,10,{"$f":"IF(ALL_C!C281=\"\",\"\",ALL_C!C281)","v":""},{"$f":"ALL_C!E281","v":0},{"$f":"ALL_C!F281","v":0},{"$f":"ALL_C!G281","v":0},{"$f":"ALL_C!H281","v":0},{"$f":"ALL_C!I281","v":0},{"$f":"ALL_C!J281","v":0},null,null,null,null,null,null,null,null,null,null,null,null,null,""]
[1,null,30,10,{"$f":"IF(ALL_C!C282=\"\",\"\",ALL_C!C282)","v":""},{"$f":"ALL_C!E282","v":0},{"$f":"ALL_C!F282","v":0},{"$f":"ALL_C!G282","v":0},{"$f":"ALL_C!H282","v":0},{"$f":"ALL_C!I282","v":0},{"$f":"ALL_C!J282","v":0},null,null,null,null,null,null,null,null,null,null,null,null,null,""]
[1,null,30,10,{"$f":"IF(ALL_C!C283=\"\",\"\",ALL_C!C283)","v":""},{"$f":"ALL_C!E283","v":0},{"$f":"ALL_C!F283","v":0},{"$f":"ALL_C!G283","v":0},{"$f":"ALL_C!H283","v":0},{"$f":"ALL_C!I283","v":0},{"$f":"ALL_C!J283","v":0},null,null,null,null,null,null,null,null,null,null,null,null,null,{"$f":"IFERROR(E195,\"#ERR\")","v":""}]
[1,null,30,10,{"$f":"IF(ALL_C!C284=\"\",\"\",ALL_C!C284)","v":""},{"$f":"ALL_C!E284","v":0},{"$f":"ALL_C!F284","v":0},{"$f":"ALL_C!G284","v":0},{"$f":"ALL_C!H284","v":0},{"$f":"ALL_C!I284","v":0},{"$f":"ALL_C!J284","v":0},null,null,null,null,null,null,null,null,null,null,null,null,null,""]
[1,null,30,10,{"$f":"IF(ALL_C!C285=\"\",\"\",ALL_C!C285)","v":""},{"$f":"ALL_C!E285","v":0},{"$f":"ALL_C!F285","v":0},{"$f":"ALL_C!G285","v":0},{"$f":"ALL_C!H285","v":0},{"$f":"ALL_C!I285","v":0},{"$f":"ALL_C!J285","v":0},null,null,null,null,null,null,null,null,null,null,null,null,null,""]
[1,null,30,10,{"$f":"IF(ALL_C!C286=\"\",\"\",ALL_C!C286)","v":""},{"$f":"ALL_C!E286","v":0},{"$f":"ALL_C!F286","v":0},{"$f":"ALL_C!G286","v":0},{"$f":"ALL_C!H286","v":0},{"$f":"ALL_C!I286","v":0},{"$f":"ALL_C!J286","v":0},null,null,null,null,null,null,null,null,null,null,null,null,null,""]
[1,null,30,10,{"$f":"IF(ALL_C!C287=\"\",\"\",ALL_C!C287)","v":""},{"$f":"ALL_C!E287","v":0},{"$f":"ALL_C!F287","v":0},{"$f":"ALL_C!G287","v":0},{"$f":"ALL_C!H287","v":0},{"$f":"ALL_C!I287","v":0},{"$f":"ALL_C!J287","v":0},null,null,null,null,null,null,null,null,null,null,null,null,null,""]
[1,null,30,10,{"$f":"IF(ALL_C!C288=\"\",\"\",ALL_C!C288)","v":""},{"$f":"ALL_C!E288","v":0},{"$f":"ALL_C!F288","v":0},{"$f":"ALL_C!G288","v":0},{"$f":"ALL_C!H288","v":0},{"$f":"ALL_C!I288","v":0},{"$f":"ALL_C!J288","v":0},null,null,null,null,null,null,null,null,null,null,null,null,null,""]
[1,null,30,10,{"$f":"IF(ALL_C!C289=\"\",\"\",ALL_C!C289)","v":""},{"$f":"ALL_C!E289","v":0},{"$f":"ALL_C!F289","v":0},{"$f":"ALL_C!G289","v":0},{"$f":"ALL_C!H289","v":0},{"$f":"ALL_C!I289","v":0},{"$f":"ALL_C!J289","v":0},null,null,null,null,null,null,null,null,null,null,null,null,null,""]
[1,null,30,20,{"$f":"IF(ALL_C!C294=\"\",\"\",ALL_C!C294)","v":""},{"$f":"ALL_C!E294","v":0},{"$f":"ALL_C!F294","v":0},{"$f":"ALL_C!G294","v":0},{"$f":"ALL_C!H294","v":0},{"$f":"ALL_C!I294","v":0},{"$f":"ALL_C!J294","v":0},null,null,null,null,null,null,null,null,null,null,null,null,null,""]
[1,null,30,20,{"$f":"IF(ALL_C!C295=\"\",\"\",ALL_C!C295)","v":""},{"$f":"ALL_C!E295","v":0},{"$f":"ALL_C!F295","v":0},{"$f":"ALL_C!G295","v":0},{"$f":"ALL_C!H295","v":0},{"$f":"ALL_C!I295","v":0},{"$f":"ALL_C!J295","v":0},null,null,null,null,null,null,null,null,null,null,null,null,null,""]
[1,null,30,20,{"$f":"IF(ALL_C!C296=\"\",\"\",ALL_C!C296)","v":""},{"$f":"ALL_C!E296","v":0},{"$f":"ALL_C!F296","v":0},{"$f":"ALL_C!G296","v":0},{"$f":"ALL_C!H296","v":0},{"$f":"ALL_C!I296","v":0},{"$f":"ALL_C!J296","v":0},null,null,null,null,null,null,null,null,null,null,null,null,null,""]
[1,null,30,20,{"$f":"IF(ALL_C!C297=\"\",\"\",ALL_C!C297)","v":""},{"$f":"ALL_C!E297","v":0},{"$f":"ALL_C!F297","v":0},{"$f":"ALL_C!G297","v":0},{"$f":"ALL_C!H297","v":0},{"$f":"ALL_C!I297","v":0},{"$f":"ALL_C!J297","v":0},null,null,null,null,null,null,null,null,null,null,null,null,null,""]
[1,null,30,20,{"$f":"IF(ALL_C!C298=\"\",\"\",ALL_C!C298)","v":""},{"$f":"ALL_C!E298","v":0},{"$f":"ALL_C!F298","v":0},{"$f":"ALL_C!G298","v":0},{"$f":"ALL_C!H298","v":0},{"$f":"ALL_C!I298","v":0},{"$f":"ALL_C!J298","v":0},null,null,null,null,null,null,null,null,null,null,null,null,null,""]
[1,null,30,20,{"$f":"IF(ALL_C!C299=\"\",\"\",ALL_C!C299)","v":""},{"$f":"ALL_C!E299","v":0},{"$f":"ALL_C!F299","v":0},{"$f":"ALL_C!G299","v":0},{"$f":"ALL_C!H299","v":0},{"$f":"ALL_C!I299","v":0},{"$f":"ALL_C!J299","v":0},null,null,null,null,null,null,null,null,null,null,null,null,null,""]
[1,null,30,20,{"$f":"IF(ALL_C!C300=\"\",\"\",ALL_C!C300)","v":""},{"$f":"ALL_C!E300","v":0},{"$f":"ALL_C!F300","v":0},{"$f":"ALL_C!G300","v":0},{"$f":"ALL_C!H300","v":0},{"$f":"ALL_C!I300","v":0},{"$f":"ALL_C!J300","v":0},null,null,null,null,null,null,null,null,null,null,null,null,null,""]
[1,null,30,20,{"$f":"IF(ALL_C!C301=\"\",\"\",ALL_C!C301)","v":""},{"$f":"ALL_C!E301","v":0},{"$f":"ALL_C!F301","v":0},{"$f":"ALL_C!G301","v":0},{"$f":"ALL_C!H301","v":0},{"$f":"ALL_C!I301","v":0},{"$f":"ALL_C!J301","v":0},null,null,null,null,null,null,null,null,null,null,null,null,null,""]
[1,null,30,20,{"$f":"IF(ALL_C!C302=\"\",\"\",ALL_C!C302)","v":""},{"$f":"ALL_C!E302","v":0},{"$f":"ALL_C!F302","v":0},{"$f":"ALL_C!G302","v":0},{"$f":"ALL_C!H302","v":0},{"$f":"ALL_C!I302","v":0},{"$f":"ALL_C!J302","v":0},null,null,null,null,null,null,null,null,null,null,null,null,null,""]
[1,null,30,20,{"$f":"IF(ALL_C!C303=\"\",\"\",ALL_C!C303)","v":""},{"$f":"ALL_C!E303","v":0},{"$f":"ALL_C!F303","v":0},{"$f":"ALL_C!G303","v":0},{"$f":"ALL_C!H303","v":0},{"$f":"ALL_C!I303","v":0},{"$f":"ALL_C!J303","v":0},null,null,null,null,null,null,null,null,null,null,null,null,null,""]
[1,null,30,20,{"$f":"IF(ALL_C!C304=\"\",\"\",ALL_C!C304)","v":""},{"$f":"ALL_C!E304","v":0},{"$f":"ALL_C!F304","v":0},{"$f":"ALL_C!G304","v":0},{"$f":"ALL_C!H304","v":0},{"$f":"ALL_C!I304","v":0},{"$f":"ALL_C!J304","v":0},null,null,null,null,null,null,null,null,null,null,null,null,null,""]
[1,null,30,20,{"$f":"IF(ALL_C!C305=\"\",\"\",ALL_C!C305)","v":""},{"$f":"ALL_C!E305","v":0},{"$f":"ALL_C!F305","v":0},{"$f":"ALL_C!G305","v":0},{"$f":"ALL_C!H305","v":0},{"$f":"ALL_C!I305","v":0},{"$f":"ALL_C!J305","v":0},null,null,null,null,null,null,null,null,null,null,null,null,null,""]
[1,null,30,20,{"$f":"IF(ALL_C!C306=\"\",\"\",ALL_C!C306)","v":""},{"$f":"ALL_C!E306","v":0},{"$f":"ALL_C!F306","v":0},{"$f":"ALL_C!G306","v":0},{"$f":"ALL_C!H306","v":0},{"$f":"ALL_C!I306","v":0},{"$f":"ALL_C!J306","v":0},null,null,null,null,null,null,null,null,null,null,null,null,null,""]
[1,null,30,20,{"$f":"IF(ALL_C!C307=\"\",\"\",ALL_C!C307)","v":""},{"$f":"ALL_C!E307","v":0},{"$f":"ALL_C!F307","v":0},{"$f":"ALL_C!G307","v":0},{"$f":"ALL_C!H307","v":0},{"$f":"ALL_C!I307","v":0},{"$f":"ALL_C!J307","v":0},null,null,null,null,null,null,null,null,null,null,null,null,null,""]
[1,null,30,20,{"$f":"IF(ALL_C!C308=\"\",\"\",ALL_C!C308)","v":""},{"$f":"ALL_C!E308","v":0},{"$f":"ALL_C!F308","v":0},{"$f":"ALL_C!G308","v":0},{"$f":"ALL_C!H308","v":0},{"$f":"ALL_C!I308","v":0},{"$f":"ALL_C!J308","v":0},null,null,null,null,null,null,null,null,null,null,null,null,null,""]
[1,null,30,20,{"$f":"IF(ALL_C!C309=\"\",\"\",ALL_C!C309)","v":""},{"$f":"ALL_C!E309","v":0},{"$f":"ALL_C!F309","v":0},{"$f":"ALL_C!G309","v":0},{"$f":"ALL_C!H309","v":0},{"$f":"ALL_C!I309","v":0},{"$f":"ALL_C!J309","v":0},null,null,null,null,null,null,null,null,null,null,null,null,null,""]
[1,null,30,20,{"$f":"IF(ALL_C!C310=\"\",\"\",ALL_C!C310)","v":""},{"$f":"ALL_C!E310","v":0},{"$f":"ALL_C!F310","v":0},{"$f":"ALL_C!G310","v":0},{"$f":"ALL_C!H310","v":0},{"$f":"ALL_C!I310","v":0},{"$f":"ALL_C!J310","v":0},null,null,null,null,null,null,null,null,null,null,null,null,null,""]
[1,null,30,20,{"$f":"IF(ALL_C!C311=\"\",\"\",ALL_C!C311)","v":""},{"$f":"ALL_C!E311","v":0},{"$f":"ALL_C!F311","v":0},{"$f":"ALL_C!G311","v":0},{"$f":"ALL_C!H311","v":0},{"$f":"ALL_C!I311","v":0},{"$f":"ALL_C!J311","v":0},null,null,null,null,null,null,null,null,null,null,null,null,null,""]
[1,null,30,20,{"$f":"IF(ALL_C!C312=\"\",\"\",ALL_C!C312)","v":""},{"$f":"ALL_C!E312","v":0},{"$f":"ALL_C!F312","v":0},{"$f":"ALL_C!G312","v":0},{"$f":"ALL_C!H312","v":0},{"$f":"ALL_C!I312","v":0},{"$f":"ALL_C!J312","v":0},null,null,null,null,null,null,null,null,null,null,null,null,null,""]
[1,null,30,20,{"$f":"IF(ALL_C!C313=\"\",\"\",ALL_C!C313)","v":""},{"$f":"ALL_C!E313","v":0},{"$f":"ALL_C!F313","v":0},{"$f":"ALL_C!G313","v":0},{"$f":"ALL_C!H313","v":0},{"$f":"ALL_C!I313","v":0},{"$f":"ALL_C!J313","v":0},null,null,null,null,null,null,null,null,null,null,null,null,null,""]
[1,null,30,20,{"$f":"IF(ALL_C!C314=\"\",\"\",ALL_C!C314)","v":""},{"$f":"ALL_C!E314","v":0},{"$f":"ALL_C!F314","v":0},{"$f":"ALL_C!G314","v":0},{"$f":"ALL_C!H314","v":0},{"$f":"ALL_C!I314","v":0},{"$f":"ALL_C!J314","v":0},null,null,null,null,null,null,null,null,null,null,null,null,null,""]
[1,null,30,20,{"$f":"IF(ALL_C!C315=\"\",\"\",ALL_C!C315)","v":""},{"$f":"ALL_C!E315","v":0},{"$f":"ALL_C!F315","v":0},{"$f":"ALL_C!G315","v":0},{"$f":"ALL_C!H315","v":0},{"$f":"ALL_C!I315","v":0},{"$f":"ALL_C!J315","v":0},null,null,null,null,null,null,null,null,null,null,null,null,null,""]
[1,null,30,20,{"$f":"IF(ALL_C!C316=\"\",\"\",ALL_C!C316)","v":""},{"$f":"ALL_C!E316","v":0},{"$f":"ALL_C!F316","v":0},{"$f":"ALL_C!G316","v":0},{"$f":"ALL_C!H316","v":0},{"$f":"ALL_C!I316","v":0},{"$f":"ALL_C!J316","v":0},null,null,null,null,null,null,null,null,null,null,null,null,null,""]
[1,null,30,20,{"$f":"IF(ALL_C!C317=\"\",\"\",ALL_C!C317)","v":""},{"$f":"ALL_C!E317","v":0},{"$f":"ALL_C!F317","v":0},{"$f":"ALL_C!G317","v":0},{"$f":"ALL_C!H317","v":0},{"$f":"ALL_C!I317","v":0},{"$f":"ALL_C!J317","v":0},null,null,null,null,null,null,null,null,null,null,null,null,null,""]
[1,null,30,20,{"$f":"IF(ALL_C!C318=\"\",\"\",ALL_C!C318)","v":""},{"$f":"ALL_C!E318","v":0},{"$f":"ALL_C!F318","v":0},{"$f":"ALL_C!G318","v":0},{"$f":"ALL_C!H318","v":0},{"$f":"ALL_C!I318","v":0},{"$f":"ALL_C!J318","v":0},null,null,null,null,null,null,null,null,null,null,null,null,null,""]
[1,null,30,20,{"$f":"IF(ALL_C!C319=\"\",\"\",ALL_C!C319)","v":""},{"$f":"ALL_C!E319","v":0},{"$f":"ALL_C!F319","v":0},{"$f":"ALL_C!G319","v":0},{"$f":"ALL_C!H319","v":0},{"$f":"ALL_C!I319","v":0},{"$f":"ALL_C!J319","v":0},null,null,null,null,null,null,null,null,null,null,null,null,null,""]
[1,null,30,20,{"$f":"IF(ALL_C!C320=\"\",\"\",ALL_C!C320)","v":""},{"$f":"ALL_C!E320","v":0},{"$f":"ALL_C!F320","v":0},{"$f":"ALL_C!G320","v":0},{"$f":"ALL_C!H320","v":0},{"$f":"ALL_C!I320","v":0},{"$f":"ALL_C!J320","v":0},null,null,null,null,null,null,null,null,null,null,null,null,null,""]
[1,null,30,20,{"$f":"IF(ALL_C!C321=\"\",\"\",ALL_C!C321)","v":""},{"$f":"ALL_C!E321","v":0},{"$f":"ALL_C!F321","v":0},{"$f":"ALL_C!G321","v":0},{"$f":"ALL_C!H321","v":0},{"$f":"ALL_C!I321","v":0},{"$f":"ALL_C!J321","v":0},null,null,null,null,null,null,null,null,null,null,null,null,null,""]
[1,null,30,20,{"$f":"IF(ALL_C!C322=\"\",\"\",ALL_C!C322)","v":""},{"$f":"ALL_C!E322","v":0},{"$f":"ALL_C!F322","v":0},{"$f":"ALL_C!G322","v":0},{"$f":"ALL_C!H322","v":0},{"$f":"ALL_C!I322","v":0},{"$f":"ALL_C!J322","v":0},null,null,null,null,null,null,null,null,null,null,null,null,null,""]
[1,null,30,20,{"$f":"IF(ALL_C!C323=\"\",\"\",ALL_C!C323)","v":""},{"$f":"ALL_C!E323","v":0},{"$f":"ALL_C!F323","v":0},{"$f":"ALL_C!G323","v":0},{"$f":"ALL_C!H323","v":0},{"$f":"ALL_C!I323","v":0},{"$f":"ALL_C!J323","v":0},null,null,null,null,null,null,null,null,null,null,null,null,null,""]
[1,null,30,20,{"$f":"IF(ALL_C!C324=\"\",\"\",ALL_C!C324)","v":""},{"$f":"ALL_C!E324","v":0},{"$f":"ALL_C!F324","v":0},{"$f":"ALL_C!G324","v":0},{"$f":"ALL_C!H324","v":0},{"$f":"ALL_C!I324","v":0},{"$f":"ALL_C!J324","v":0},null,null,null,null,null,null,null,null,null,null,null,null,null,""]
[1,null,30,20,{"$f":"IF(ALL_C!C325=\"\",\"\",ALL_C!C325)","v":""},{"$f":"ALL_C!E325","v":0},{"$f":"ALL_C!F325","v":0},{"$f":"ALL_C!G325","v":0},{"$f":"ALL_C!H325","v":0},{"$f":"ALL_C!I325","v":0},{"$f":"ALL_C!J325","v":0},null,null,null,null,null,null,null,null,null,null,null,null,null,""]
[1,null,30,20,{"$f":"IF(ALL_C!C326=\"\",\"\",ALL_C!C326)","v":""},{"$f":"ALL_C!E326","v":0},{"$f":"ALL_C!F326","v":0},{"$f":"ALL_C!G326","v":0},{"$f":"ALL_C!H326","v":0},{"$f":"ALL_C!I326","v":0},{"$f":"ALL_C!J326","v":0},null,null,null,null,null,null,null,null,null,null,null,null,null,""]
[1,null,30,20,{"$f":"IF(ALL_C!C327=\"\",\"\",ALL_C!C327)","v":""},{"$f":"ALL_C!E327","v":0},{"$f":"ALL_C!F327","v":0},{"$f":"ALL_C!G327","v":0},{"$f":"ALL_C!H327","v":0},{"$f":"ALL_C!I327","v":0},{"$f":"ALL_C!J327","v":0},null,null,null,null,null,null,null,null,null,null,null,null,null,""]
[1,null,30,20,{"$f":"IF(ALL_C!C328=\"\",\"\",ALL_C!C328)","v":""},{"$f":"ALL_C!E328","v":0},{"$f":"ALL_C!F328","v":0},{"$f":"ALL_C!G328","v":0},{"$f":"ALL_C!H328","v":0},{"$f":"ALL_C!I328","v":0},{"$f":"ALL_C!J328","v":0},null,null,null,null,null,null,null,null,null,null,null,null,null,""]
[1,null,30,20,{"$f":"IF(ALL_C!C329=\"\",\"\",ALL_C!C329)","v":""},{"$f":"ALL_C!E329","v":0},{"$f":"ALL_C!F329","v":0},{"$f":"ALL_C!G329","v":0},{"$f":"ALL_C!H329","v":0},{"$f":"ALL_C!I329","v":0},{"$f":"ALL_C!J329","v":0},null,null,null,null,null,null,null,null,null,null,null,null,null,""]
[1,null,30,20,{"$f":"IF(ALL_C!C330=\"\",\"\",ALL_C!C330)","v":""},{"$f":"ALL_C!E330","v":0},{"$f":"ALL_C!F330","v":0},{"$f":"ALL_C!G330","v":0},{"$f":"ALL_C!H330","v":0},{"$f":"ALL_C!I330","v":0},{"$f":"ALL_C!J330","v":0},null,null,null,null,null,null,null,null,null,null,null,null,null,""]
[1,null,30,20,{"$f":"IF(ALL_C!C331=\"\",\"\",ALL_C!C331)","v":""},{"$f":"ALL_C!E331","v":0},{"$f":"ALL_C!F331","v":0},{"$f":"ALL_C!G331","v":0},{"$f":"ALL_C!H331","v":0},{"$f":"ALL_C!I331","v":0},{"$f":"ALL_C!J331","v":0},null,null,null,null,null,null,null,null,null,null,null,null,null,""]
[1,null,30,20,{"$f":"IF(ALL_C!C332=\"\",\"\",ALL_C!C332)","v":""},{"$f":"ALL_C!E332","v":0},{"$f":"ALL_C!F332","v":0},{"$f":"ALL_C!G332","v":0},{"$f":"ALL_C!H332","v":0},{"$f":"ALL_C!I332","v":0},{"$f":"ALL_C!J332","v":0},null,null,null,null,null,null,null,null,null,null,null,null,null,""]
[1,null,30,20,{"$f":"IF(ALL_C!C333=\"\",\"\",ALL_C!C333)","v":""},{"$f":"ALL_C!E333","v":0},{"$f":"ALL_C!F333","v":0},{"$f":"ALL_C!G333","v":0},{"$f":"ALL_C!H333","v":0},{"$f":"ALL_C!I333","v":0},{"$f":"ALL_C!J333","v":0},null,null,null,null,null,null,null,null,null,null,null,null,null,""]
[1,null,30,20,{"$f":"IF(ALL_C!C334=\"\",\"\",ALL_C!C334)","v":""},{"$f":"ALL_C!E334","v":0},{"$f":"ALL_C!F334","v":0},{"$f":"ALL_C!G334","v":0},{"$f":"ALL_C!H334","v":0},{"$f":"ALL_C!I334","v":0},{"$f":"ALL_C!J334","v":0},null,null,null,null,null,null,null,null,null,null,null,null,null,""]
[1,null,30,20,{"$f":"IF(ALL_C!C335=\"\",\"\",ALL_C!C335)","v":""},{"$f":"ALL_C!E335","v":0},{"$f":"ALL_C!F335","v":0},{"$f":"ALL_C!G335","v":0},{"$f":"ALL_C!H335","v":0},{"$f":"ALL_C!I335","v":0},{"$f":"ALL_C!J335","v":0},null,null,null,null,null,null,null,null,null,null,null,null,null,""]
[1,null,30,20,{"$f":"IF(ALL_C!C336=\"\",\"\",ALL_C!C336)","v":""},{"$f":"ALL_C!E336","v":0},{"$f":"ALL_C!F336","v":0},{"$f":"ALL_C!G336","v":0},{"$f":"ALL_C!H336","v":0},{"$f":"ALL_C!I336","v":0},{"$f":"ALL_C!J336","v":0},null,null,null,null,null,null,null,null,null,null,null,null,null,""]
[1,null,30,20,{"$f":"IF(ALL_C!C337=\"\",\"\",ALL_C!C337)","v":""},{"$f":"ALL_C!E337","v":0},{"$f":"ALL_C!F337","v":0},{"$f":"ALL_C!G337","v":0},{"$f":"ALL_C!H337","v":0},{"$f":"ALL_C!I337","v":0},{"$f":"ALL_C!J337","v":0},null,null,null,null,null,null,null,null,null,null,null,null,null,""]
[1,null,30,20,{"$f":"IF(ALL_C!C338=\"\",\"\",ALL_C!C338)","v":""},{"$f":"ALL_C!E338","v":0},{"$f":"ALL_C!F338","v":0},{"$f":"ALL_C!G338","v":0},{"$f":"ALL_C!H338","v":0},{"$f":"ALL_C!I338","v":0},{"$f":"ALL_C!J338","v":0},null,null,null,null,null,null,null,null,null,null,null,null,null,""]
[1,null,30,20,{"$f":"IF(ALL_C!C339=\"\",\"\",ALL_C!C339)","v":""},{"$f":"ALL_C!E339","v":0},{"$f":"ALL_C!F339","v":0},{"$f":"ALL_C!G339","v":0},{"$f":"ALL_C!H339","v":0},{"$f":"ALL_C!I339","v":0},{"$f":"ALL_C!J339","v":0},null,null,null,null,null,null,null,null,null,null,null,null,null,""]
[1,null,30,20,{"$f":"IF(ALL_C!C340=\"\",\"\",ALL_C!C340)","v":""},{"$f":"ALL_C!E340","v":0},{"$f":"ALL_C!F340","v":0},{"$f":"ALL_C!G340","v":0},{"$f":"ALL_C!H340","v":0},{"$f":"ALL_C!I340","v":0},{"$f":"ALL_C!J340","v":0},null,null,null,null,null,null,null,null,null,null,null,null,null,""]
[1,null,30,20,{"$f":"IF(ALL_C!C341=\"\",\"\",ALL_C!C341)","v":""},{"$f":"ALL_C!E341","v":0},{"$f":"ALL_C!F341","v":0},{"$f":"ALL_C!G341","v":0},{"$f":"ALL_C!H341","v":0},{"$f":"ALL_C!I341","v":0},{"$f":"ALL_C!J341","v":0},null,null,null,null,null,null,null,null,null,null,null,null,null,""]
[1,null,30,20,{"$f":"IF(ALL_C!C342=\"\",\"\",ALL_C!C342)","v":""},{"$f":"ALL_C!E342","v":0},{"$f":"ALL_C!F342","v":0},{"$f":"ALL_C!G342","v":0},{"$f":"ALL_C!H342","v":0},{"$f":"ALL_C!I342","v":0},{"$f":"ALL_C!J342","v":0},null,null,null,null,null,null,null,null,null,null,null,null,null,""]
[1,null,30,20,{"$f":"IF(ALL_C!C343=\"\",\"\",ALL_C!C343)","v":""},{"$f":"ALL_C!E343","v":0},{"$f":"ALL_C!F343","v":0},{"$f":"ALL_C!G343","v":0},{"$f":"ALL_C!H343","v":0},{"$f":"ALL_C!I343","v":0},{"$f":"ALL_C!J343","v":0},null,null,null,null,null,null,null,null,null,null,null,null,null,""]
[1,null,30,30,{"$f":"IF(ALL_C!C348=\"\",\"\",ALL_C!C348)","v":""},{"$f":"ALL_C!E348","v":0},{"$f":"ALL_C!F348","v":0},{"$f":"ALL_C!G348","v":0},{"$f":"ALL_C!H348","v":0},{"$f":"ALL_C!I348","v":0},{"$f":"ALL_C!J348","v":0},null,null,null,null,null,null,null,null,null,null,null,null,null,""]
[1,null,30,30,{"$f":"IF(ALL_C!C349=\"\",\"\",ALL_C!C349)","v":""},{"$f":"ALL_C!E349","v":0},{"$f":"ALL_C!F349","v":0},{"$f":"ALL_C!G349","v":0},{"$f":"ALL_C!H349","v":0},{"$f":"ALL_C!I349","v":0},{"$f":"ALL_C!J349","v":0},null,null,null,null,null,null,null,null,null,null,null,null,null,""]
[1,null,30,30,{"$f":"IF(ALL_C!C350=\"\",\"\",ALL_C!C350)","v":""},{"$f":"ALL_C!E350","v":0},{"$f":"ALL_C!F350","v":0},{"$f":"ALL_C!G350","v":0},{"$f":"ALL_C!H350","v":0},{"$f":"ALL_C!I350","v":0},{"$f":"ALL_C!J350","v":0},null,null,null,null,null,null,null,null,null,null,null,null,null,""]
[1,null,30,30,{"$f":"IF(ALL_C!C351=\"\",\"\",ALL_C!C351)","v":""},{"$f":"ALL_C!E351","v":0},{"$f":"ALL_C!F351","v":0},{"$f":"ALL_C!G351","v":0},{"$f":"ALL_C!H351","v":0},{"$f":"ALL_C!I351","v":0},{"$f":"ALL_C!J351","v":0},null,null,null,null,null,null,null,null,null,null,null,null,null,""]
[1,null,30,30,{"$f":"IF(ALL_C!C352=\"\",\"\",ALL_C!C352)","v":""},{"$f":"ALL_C!E352","v":0},{"$f":"ALL_C!F352","v":0},{"$f":"ALL_C!G352","v":0},{"$f":"ALL_C!H352","v":0},{"$f":"ALL_C!I352","v":0},{"$f":"ALL_C!J352","v":0},null,null,null,null,null,null,null,null,null,null,null,null,null,""]
[1,null,30,30,{"$f":"IF(ALL_C!C353=\"\",\"\",ALL_C!C353)","v":""},{"$f":"ALL_C!E353","v":0},{"$f":"ALL_C!F353","v":0},{"$f":"ALL_C!G353","v":0},{"$f":"ALL_C!H353","v":0},{"$f":"ALL_C!I353","v":0},{"$f":"ALL_C!J353","v":0},null,null,null,null,null,null,null,null,null,null,null,null,null,""]
[1,null,30,30,{"$f":"IF(ALL_C!C354=\"\",\"\",ALL_C!C354)","v":""},{"$f":"ALL_C!E354","v":0},{"$f":"ALL_C!F354","v":0},{"$f":"ALL_C!G354","v":0},{"$f":"ALL_C!H354","v":0},{"$f":"ALL_C!I354","v":0},{"$f":"ALL_C!J354","v":0},null,null,null,null,null,null,null,null,null,null,null,null,null,""]
[1,null,30,30,{"$f":"IF(ALL_C!C355=\"\",\"\",ALL_C!C355)","v":""},{"$f":"ALL_C!E355","v":0},{"$f":"ALL_C!F355","v":0},{"$f":"ALL_C!G355","v":0},{"$f":"ALL_C!H355","v":0},{"$f":"ALL_C!I355","v":0},{"$f":"ALL_C!J355","v":0},null,null,null,null,null,null,null,null,null,null,null,null,null,{"$f":"IFERROR(E259,\"#ERR\")","v":""}]
[1,null,30,30,{"$f":"IF(ALL_C!C356=\"\",\"\",ALL_C!C356)","v":""},{"$f":"ALL_C!E356","v":0},{"$f":"ALL_C!F356","v":0},{"$f":"ALL_C!G356","v":0},{"$f":"ALL_C!H356","v":0},{"$f":"ALL_C!I356","v":0},{"$f":"ALL_C!J356","v":0},null,null,null,null,null,null,null,null,null,null,null,null,null,""]
[1,null,30,30,{"$f":"IF(ALL_C!C357=\"\",\"\",ALL_C!C357)","v":""},{"$f":"ALL_C!E357","v":0},{"$f":"ALL_C!F357","v":0},{"$f":"ALL_C!G357","v":0},{"$f":"ALL_C!H357","v":0},{"$f":"ALL_C!I357","v":0},{"$f":"ALL_C!J357","v":0},null,null,null,null,null,null,null,null,null,null,null,null,null,""]
[1,null,30,30,{"$f":"IF(ALL_C!C358=\"\",\"\",ALL_C!C358)","v":""},{"$f":"ALL_C!E358","v":0},{"$f":"ALL_C!F358","v":0},{"$f":"ALL_C!G358","v":0},{"$f":"ALL_C!H358","v":0},{"$f":"ALL_C!I358","v":0},{"$f":"ALL_C!J358","v":0},null,null,null,null,null,null,null,null,null,null,null,null,null,""]
[1,null,30,30,{"$f":"IF(ALL_C!C359=\"\",\"\",ALL_C!C359)","v":""},{"$f":"ALL_C!E359","v":0},{"$f":"ALL_C!F359","v":0},{"$f":"ALL_C!G359","v":0},{"$f":"ALL_C!H359","v":0},{"$f":"ALL_C!I359","v":0},{"$f":"ALL_C!J359","v":0},null,null,null,null,null,null,null,null,null,null,null,null,null,""]
[1,null,30,30,{"$f":"IF(ALL_C!C360=\"\",\"\",ALL_C!C360)","v":""},{"$f":"ALL_C!E360","v":0},{"$f":"ALL_C!F360","v":0},{"$f":"ALL_C!G360","v":0},{"$f":"ALL_C!H360","v":0},{"$f":"ALL_C!I360","v":0},{"$f":"ALL_C!J360","v":0},null,null,null,null,null,null,null,null,null,null,null,null,null,""]
[1,null,30,30,{"$f":"IF(ALL_C!C361=\"\",\"\",ALL_C!C361)","v":""},{"$f":"ALL_C!E361","v":0},{"$f":"ALL_C!F361","v":0},{"$f":"ALL_C!G361","v":0},{"$f":"ALL_C!H361","v":0},{"$f":"ALL_C!I361","v":0},{"$f":"ALL_C!J361","v":0},null,null,null,null,null,null,null,null,null,null,null,null,null,""]
[1,null,30,30,{"$f":"IF(ALL_C!C362=\"\",\"\",ALL_C!C362)","v":""},{"$f":"ALL_C!E362","v":0},{"$f":"ALL_C!F362","v":0},{"$f":"ALL_C!G362","v":0},{"$f":"ALL_C!H362","v":0},{"$f":"ALL_C!I362","v":0},{"$f":"ALL_C!J362","v":0},null,null,null,null,null,null,null,null,null,null,null,null,null,""]
[1,null,30,30,{"$f":"IF(ALL_C!C363=\"\",\"\",ALL_C!C363)","v":""},{"$f":"ALL_C!E363","v":0},{"$f":"ALL_C!F363","v":0},{"$f":"ALL_C!G363","v":0},{"$f":"ALL_C!H363","v":0},{"$f":"ALL_C!I363","v":0},{"$f":"ALL_C!J363","v":0},null,null,null,null,null,null,null,null,null,null,null,null,null,""]
[1,null,30,30,{"$f":"IF(ALL_C!C364=\"\",\"\",ALL_C!C364)","v":""},{"$f":"ALL_C!E364","v":0},{"$f":"ALL_C!F364","v":0},{"$f":"ALL_C!G364","v":0},{"$f":"ALL_C!H364","v":0},{"$f":"ALL_C!I364","v":0},{"$f":"ALL_C!J364","v":0},null,null,null,null,null,null,null,null,null,null,null,null,null,""]
[1,null,30,30,{"$f":"IF(ALL_C!C365=\"\",\"\",ALL_C!C365)","v":""},{"$f":"ALL_C!E365","v":0},{"$f":"ALL_C!F365","v":0},{"$f":"ALL_C!G365","v":0},{"$f":"ALL_C!H365","v":0},{"$f":"ALL_C!I365","v":0},{"$f":"ALL_C!J365","v":0},null,null,null,null,null,null,null,null,null,null,null,null,null,""]
[1,null,30,30,{"$f":"IF(ALL_C!C366=\"\",\"\",ALL_C!C366)","v":""},{"$f":"ALL_C!E366","v":0},{"$f":"ALL_C!F366","v":0},{"$f":"ALL_C!G366","v":0},{"$f":"ALL_C!H366","v":0},{"$f":"ALL_C!I366","v":0},{"$f":"ALL_C!J366","v":0},null,null,null,null,null,null,null,null,null,null,null,null,null,""]
[1,null,30,30,{"$f":"IF(ALL_C!C367=\"\",\"\",ALL_C!C367)","v":""},{"$f":"ALL_C!E367","v":0},{"$f":"ALL_C!F367","v":0},{"$f":"ALL_C!G367","v":0},{"$f":"ALL_C!H367","v":0},{"$f":"ALL_C!I367","v":0},{"$f":"ALL_C!J367","v":0},null,null,null,null,null,null,null,null,null,null,null,null,null,""]
[1,null,30,30,{"$f":"IF(ALL_C!C368=\"\",\"\",ALL_C!C368)","v":""},{"$f":"ALL_C!E368","v":0},{"$f":"ALL_C!F368","v":0},{"$f":"ALL_C!G368","v":0},{"$f":"ALL_C!H368","v":0},{"$f":"ALL_C!I368","v":0},{"$f":"ALL_C!J368","v":0},null,null,null,null,null,null,null,null,null,null,null,null,null,""]
[1,null,30,30,{"$f":"IF(ALL_C!C369=\"\",\"\",ALL_C!C369)","v":""},{"$f":"ALL_C!E369","v":0},{"$f":"ALL_C!F369","v":0},{"$f":"ALL_C!G369","v":0},{"$f":"ALL_C!H369","v":0},{"$f":"ALL_C!I369","v":0},{"$f":"ALL_C!J369","v":0},null,null,null,null,null,null,null,null,null,null,null,null,null,""]
[1,null,30,30,{"$f":"IF(ALL_C!C370=\"\",\"\",ALL_C!C370)","v":""},{"$f":"ALL_C!E370","v":0},{"$f":"ALL_C!F370","v":0},{"$f":"ALL_C!G370","v":0},{"$f":"ALL_C!H370","v":0},{"$f":"ALL_C!I370","v":0},{"$f":"ALL_C!J370","v":0},null,null,null,null,null,null,null,null,null,null,null,null,null,""]
[1,null,30,30,{"$f":"IF(ALL_C!C371=\"\",\"\",ALL_C!C371)","v":""},{"$f":"ALL_C!E371","v":0},{"$f":"ALL_C!F371","v":0},{"$f":"ALL_C!G371","v":0},{"$f":"ALL_C!H371","v":0},{"$f":"ALL_C!I371","v":0},{"$f":"ALL_C!J371","v":0},null,null,null,null,null,null,null,null,null,null,null,null,null,""]
[1,null,30,30,{"$f":"IF(ALL_C!C372=\"\",\"\",ALL_C!C372)","v":""},{"$f":"ALL_C!E372","v":0},{"$f":"ALL_C!F372","v":0},{"$f":"ALL_C!G372","v":0},{"$f":"ALL_C!H372","v":0},{"$f":"ALL_C!I372","v":0},{"$f":"ALL_C!J372","v":0},null,null,null,null,null,null,null,null,null,null,null,null,null,""]
[1,null,30,30,{"$f":"IF(ALL_C!C373=\"\",\"\",ALL_C!C373)","v":""},{"$f":"ALL_C!E373","v":0},{"$f":"ALL_C!F373","v":0},{"$f":"ALL_C!G373","v":0},{"$f":"ALL_C!H373","v":0},{"$f":"ALL_C!I373","v":0},{"$f":"ALL_C!J373","v":0},null,null,null,null,null,null,null,null,null,null,null,null,null,""]
[1,null,30,30,{"$f":"IF(ALL_C!C374=\"\",\"\",ALL_C!C374)","v":""},{"$f":"ALL_C!E374","v":0},{"$f":"ALL_C!F374","v":0},{"$f":"ALL_C!G374","v":0},{"$f":"ALL_C!H374","v":0},{"$f":"ALL_C!I374","v":0},{"$f":"ALL_C!J374","v":0},null,null,null,null,null,null,null,null,null,null,null,null,null,""]
[1,null,30,30,{"$f":"IF(ALL_C!C375=\"\",\"\",ALL_C!C375)","v":""},{"$f":"ALL_C!E375","v":0},{"$f":"ALL_C!F375","v":0},{"$f":"ALL_C!G375","v":0},{"$f":"ALL_C!H375","v":0},{"$f":"ALL_C!I375","v":0},{"$f":"ALL_C!J375","v":0},null,null,null,null,null,null,null,null,null,null,null,null,null,""]
[1,null,30,30,{"$f":"IF(ALL_C!C376=\"\",\"\",ALL_C!C376)","v":""},{"$f":"ALL_C!E376","v":0},{"$f":"ALL_C!F376","v":0},{"$f":"ALL_C!G376","v":0},{"$f":"ALL_C!H376","v":0},{"$f":"ALL_C!I376","v":0},{"$f":"ALL_C!J376","v":0},null,null,null,null,null,null,null,null,null,null,null,null,null,""]
[1,null,30,30,{"$f":"IF(ALL_C!C377=\"\",\"\",ALL_C!C377)","v":""},{"$f":"ALL_C!E377","v":0},{"$f":"ALL_C!F377","v":0},{"$f":"ALL_C!G377","v":0},{"$f":"ALL_C!H377","v":0},{"$f":"ALL_C!I377","v":0},{"$f":"ALL_C!J377","v":0},null,null,null,null,null,null,null,null,null,null,null,null,null,""]
[1,null,30,30,{"$f":"IF(ALL_C!C378=\"\",\"\",ALL_C!C378)","v":""},{"$f":"ALL_C!E378","v":0},{"$f":"ALL_C!F378","v":0},{"$f":"ALL_C!G378","v":0},{"$f":"ALL_C!H378","v":0},{"$f":"ALL_C!I378","v":0},{"$f":"ALL_C!J378","v":0},null,null,null,null,null,null,null,null,null,null,null,null,null,""]
[1,null,30,30,{"$f":"IF(ALL_C!C379=\"\",\"\",ALL_C!C379)","v":""},{"$f":"ALL_C!E379","v":0},{"$f":"ALL_C!F379","v":0},{"$f":"ALL_C!G379","v":0},{"$f":"ALL_C!H379","v":0},{"$f":"ALL_C!I379","v":0},{"$f":"ALL_C!J379","v":0},null,null,null,null,null,null,null,null,null,null,null,null,null,""]
[1,null,30,30,{"$f":"IF(ALL_C!C380=\"\",\"\",ALL_C!C380)","v":""},{"$f":"ALL_C!E380","v":0},{"$f":"ALL_C!F380","v":0},{"$f":"ALL_C!G380","v":0},{"$f":"ALL_C!H380","v":0},{"$f":"ALL_C!I380","v":0},{"$f":"ALL_C!J380","v":0},null,null,null,null,null,null,null,null,null,null,null,null,null,""]
[1,null,30,30,{"$f":"IF(ALL_C!C381=\"\",\"\",ALL_C!C381)","v":""},{"$f":"ALL_C!E381","v":0},{"$f":"ALL_C!F381","v":0},{"$f":"ALL_C!G381","v":0},{"$f":"ALL_C!H381","v":0},{"$f":"ALL_C!I381","v":0},{"$f":"ALL_C!J381","v":0},null,null,null,null,null,null,null,null,null,null,null,null,null,""]
[1,null,30,30,{"$f":"IF(ALL_C!C382=\"\",\"\",ALL_C!C382)","v":""},{"$f":"ALL_C!E382","v":0},{"$f":"ALL_C!F382","v":0},{"$f":"ALL_C!G382","v":0},{"$f":"ALL_C!H382","v":0},{"$f":"ALL_C!I382","v":0},{"$f":"ALL_C!J382","v":0},null,null,null,null,null,null,null,null,null,null,null,null,null,""]
[1,null,30,30,{"$f":"IF(ALL_C!C383=\"\",\"\",ALL_C!C383)","v":""},{"$f":"ALL_C!E383","v":0},{"$f":"ALL_C!F383","v":0},{"$f":"ALL_C!G383","v":0},{"$f":"ALL_C!H383","v":0},{"$f":"ALL_C!I383","v":0},{"$f":"ALL_C!J383","v":0},null,null,null,null,null,null,null,null,null,null,null,null,null,""]
[1,null,30,30,{"$f":"IF(ALL_C!C384=\"\",\"\",ALL_C!C384)","v":""},{"$f":"ALL_C!E384","v":0},{"$f":"ALL_C!F384","v":0},{"$f":"ALL_C!G384","v":0},{"$f":"ALL_C!H384","v":0},{"$f":"ALL_C!I384","v":0},{"$f":"ALL_C!J384","v":0},null,null,null,null,null,null,null,null,null,null,null,null,null,""]
[1,null,30,30,{"$f":"IF(ALL_C!C385=\"\",\"\",ALL_C!C385)","v":""},{"$f":"ALL_C!E385","v":0},{"$f":"ALL_C!F385","v":0},{"$f":"ALL_C!G385","v":0},{"$f":"ALL_C!H385","v":0},{"$f":"ALL_C!I385","v":0},{"$f":"ALL_C!J385","v":0},null,null,null,null,null,null,null,null,null,null,null,null,null,""]
[1,null,30,30,{"$f":"IF(ALL_C!C386=\"\",\"\",ALL_C!C386)","v":""},{"$f":"ALL_C!E386","v":0},{"$f":"ALL_C!F386","v":0},{"$f":"ALL_C!G386","v":0},{"$f":"ALL_C!H386","v":0},{"$f":"ALL_C!I386","v":0},{"$f":"ALL_C!J386","v":0},null,null,null,null,null,null,null,null,null,null,null,null,null,""]
[1,null,30,30,{"$f":"IF(ALL_C!C387=\"\",\"\",ALL_C!C387)","v":""},{"$f":"ALL_C!E387","v":0},{"$f":"ALL_C!F387","v":0},{"$f":"ALL_C!G387","v":0},{"$f":"ALL_C!H387","v":0},{"$f":"ALL_C!I387","v":0},{"$f":"ALL_C!J387","v":0},null,null,null,null,null,null,null,null,null,null,null,null,null,""]
[1,null,30,30,{"$f":"IF(ALL_C!C388=\"\",\"\",ALL_C!C388)","v":""},{"$f":"ALL_C!E388","v":0},{"$f":"ALL_C!F388","v":0},{"$f":"ALL_C!G388","v":0},{"$f":"ALL_C!H388","v":0},{"$f":"ALL_C!I388","v":0},{"$f":"ALL_C!J388","v":0},null,null,null,null,null,null,null,null,null,null,null,null,null,""]
[1,null,30,30,{"$f":"IF(ALL_C!C389=\"\",\"\",ALL_C!C389)","v":""},{"$f":"ALL_C!E389","v":0},{"$f":"ALL_C!F389","v":0},{"$f":"ALL_C!G389","v":0},{"$f":"ALL_C!H389","v":0},{"$f":"ALL_C!I389","v":0},{"$f":"ALL_C!J389","v":0},null,null,null,null,null,null,null,null,null,null,null,null,null,""]
[1,null,30,30,{"$f":"IF(ALL_C!C390=\"\",\"\",ALL_C!C390)","v":""},{"$f":"ALL_C!E390","v":0},{"$f":"ALL_C!F390","v":0},{"$f":"ALL_C!G390","v":0},{"$f":"ALL_C!H390","v":0},{"$f":"ALL_C!I390","v":0},{"$f":"ALL_C!J390","v":0},null,null,null,null,null,null,null,null,null,null,null,null,null,""]
[1,null,30,30,{"$f":"IF(ALL_C!C391=\"\",\"\",ALL_C!C391)","v":""},{"$f":"ALL_C!E391","v":0},{"$f":"ALL_C!F391","v":0},{"$f":"ALL_C!G391","v":0},{"$f":"ALL_C!H391","v":0},{"$f":"ALL_C!I391","v":0},{"$f":"ALL_C!J391","v":0},null,null,null,null,null,null,null,null,null,null,null,null,null,""]
[1,null,30,30,{"$f":"IF(ALL_C!C392=\"\",\"\",ALL_C!C392)","v":""},{"$f":"ALL_C!E392","v":0},{"$f":"ALL_C!F392","v":0},{"$f":"ALL_C!G392","v":0},{"$f":"ALL_C!H392","v":0},{"$f":"ALL_C!I392","v":0},{"$f":"ALL_C!J392","v":0},null,null,null,null,null,null,null,null,null,null,null,null,null,""]
[1,null,30,30,{"$f":"IF(ALL_C!C393=\"\",\"\",ALL_C!C393)","v":""},{"$f":"ALL_C!E393","v":0},{"$f":"ALL_C!F393","v":0},{"$f":"ALL_C!G393","v":0},{"$f":"ALL_C!H393","v":0},{"$f":"ALL_C!I393","v":0},{"$f":"ALL_C!J393","v":0},null,null,null,null,null,null,null,null,null,null,null,null,null,""]
[1,null,30,30,{"$f":"IF(ALL_C!C394=\"\",\"\",ALL_C!C394)","v":""},{"$f":"ALL_C!E394","v":0},{"$f":"ALL_C!F394","v":0},{"$f":"ALL_C!G394","v":0},{"$f":"ALL_C!H394","v":0},{"$f":"ALL_C!I394","v":0},{"$f":"ALL_C!J394","v":0},null,null,null,null,null,null,null,null,null,null,null,null,null,""]
[1,null,30,30,{"$f":"IF(ALL_C!C395=\"\",\"\",ALL_C!C395)","v":""},{"$f":"ALL_C!E395","v":0},{"$f":"ALL_C!F395","v":0},{"$f":"ALL_C!G395","v":0},{"$f":"ALL_C!H395","v":0},{"$f":"ALL_C!I395","v":0},{"$f":"ALL_C!J395","v":0},null,null,null,null,null,null,null,null,null,null,null,null,null,""]
[1,null,30,30,{"$f":"IF(ALL_C!C396=\"\",\"\",ALL_C!C396)","v":""},{"$f":"ALL_C!E396","v":0},{"$f":"ALL_C!F396","v":0},{"$f":"ALL_C!G396","v":0},{"$f":"ALL_C!H396","v":0},{"$f":"ALL_C!I396","v":0},{"$f":"ALL_C!J396","v":0},null,null,null,null,null,null,null,null,null,null,null,null,null,""]
[1,null,30,30,{"$f":"IF(ALL_C!C397=\"\",\"\",ALL_C!C397)","v":""},{"$f":"ALL_C!E397","v":0},{"$f":"ALL_C!F397","v":0},{"$f":"ALL_C!G397","v":0},{"$f":"ALL_C!H397","v":0},{"$f":"ALL_C!I397","v":0},{"$f":"ALL_C!J397","v":0},null,null,null,null,null,null,null,null,null,null,null,null,null,""]
[1,null,40,10,{"$f":"IF(ALL_C!C411=\"\",\"\",ALL_C!C411)","v":""},{"$f":"ALL_C!E411","v":0},{"$f":"ALL_C!F411","v":0},{"$f":"ALL_C!G411","v":0},{"$f":"ALL_C!H411","v":0},{"$f":"ALL_C!I411","v":0},{"$f":"ALL_C!J411","v":0},null,null,null,null,null,null,null,null,null,null,null,null,null,""]
[1,null,40,10,{"$f":"IF(ALL_C!C412=\"\",\"\",ALL_C!C412)","v":""},{"$f":"ALL_C!E412","v":0},{"$f":"ALL_C!F412","v":0},{"$f":"ALL_C!G412","v":0},{"$f":"ALL_C!H412","v":0},{"$f":"ALL_C!I412","v":0},{"$f":"ALL_C!J412","v":0},null,null,null,null,null,null,null,null,null,null,null,null,null,""]
[1,null,40,10,{"$f":"IF(ALL_C!C413=\"\",\"\",ALL_C!C413)","v":""},{"$f":"ALL_C!E413","v":0},{"$f":"ALL_C!F413","v":0},{"$f":"ALL_C!G413","v":0},{"$f":"ALL_C!H413","v":0},{"$f":"ALL_C!I413","v":0},{"$f":"ALL_C!J413","v":0},null,null,null,null,null,null,null,null,null,null,null,null,null,""]
[1,null,40,10,{"$f":"IF(ALL_C!C414=\"\",\"\",ALL_C!C414)","v":""},{"$f":"ALL_C!E414","v":0},{"$f":"ALL_C!F414","v":0},{"$f":"ALL_C!G414","v":0},{"$f":"ALL_C!H414","v":0},{"$f":"ALL_C!I414","v":0},{"$f":"ALL_C!J414","v":0},null,null,null,null,null,null,null,null,null,null,null,null,null,""]
[1,null,40,10,{"$f":"IF(ALL_C!C415=\"\",\"\",ALL_C!C415)","v":""},{"$f":"ALL_C!E415","v":0},{"$f":"ALL_C!F415","v":0},{"$f":"ALL_C!G415","v":0},{"$f":"ALL_C!H415","v":0},{"$f":"ALL_C!I415","v":0},{"$f":"ALL_C!J415","v":0},null,null,null,null,null,null,null,null,null,null,null,null,null,""]
[1,null,40,10,{"$f":"IF(ALL_C!C416=\"\",\"\",ALL_C!C416)","v":""},{"$f":"ALL_C!E416","v":0},{"$f":"ALL_C!F416","v":0},{"$f":"ALL_C!G416","v":0},{"$f":"ALL_C!H416","v":0},{"$f":"ALL_C!I416","v":0},{"$f":"ALL_C!J416","v":0},null,null,null,null,null,null,null,null,null,null,null,null,null,""]
[1,null,40,10,{"$f":"IF(ALL_C!C417=\"\",\"\",ALL_C!C417)","v":""},{"$f":"ALL_C!E417","v":0},{"$f":"ALL_C!F417","v":0},{"$f":"ALL_C!G417","v":0},{"$f":"ALL_C!H417","v":0},{"$f":"ALL_C!I417","v":0},{"$f":"ALL_C!J417","v":0},null,null,null,null,null,null,null,null,null,null,null,null,null,""]
[1,null,40,10,{"$f":"IF(ALL_C!C418=\"\",\"\",ALL_C!C418)","v":""},{"$f":"ALL_C!E418","v":0},{"$f":"ALL_C!F418","v":0},{"$f":"ALL_C!G418","v":0},{"$f":"ALL_C!H418","v":0},{"$f":"ALL_C!I418","v":0},{"$f":"ALL_C!J418","v":0},null,null,null,null,null,null,null,null,null,null,null,null,null,""]
[1,null,40,10,{"$f":"IF(ALL_C!C419=\"\",\"\",ALL_C!C419)","v":""},{"$f":"ALL_C!E419","v":0},{"$f":"ALL_C!F419","v":0},{"$f":"ALL_C!G419","v":0},{"$f":"ALL_C!H419","v":0},{"$f":"ALL_C!I419","v":0},{"$f":"ALL_C!J419","v":0},null,null,null,null,null,null,null,null,null,null,null,null,null,""]
[1,null,40,10,{"$f":"IF(ALL_C!C420=\"\",\"\",ALL_C!C420)","v":""},{"$f":"ALL_C!E420","v":0},{"$f":"ALL_C!F420","v":0},{"$f":"ALL_C!G420","v":0},{"$f":"ALL_C!H420","v":0},{"$f":"ALL_C!I420","v":0},{"$f":"ALL_C!J420","v":0},null,null,null,null,null,null,null,null,null,null,null,null,null,""]
[1,null,40,10,{"$f":"IF(ALL_C!C421=\"\",\"\",ALL_C!C421)","v":""},{"$f":"ALL_C!E421","v":0},{"$f":"ALL_C!F421","v":0},{"$f":"ALL_C!G421","v":0},{"$f":"ALL_C!H421","v":0},{"$f":"ALL_C!I421","v":0},{"$f":"ALL_C!J421","v":0},null,null,null,null,null,null,null,null,null,null,null,null,null,""]
[1,null,40,10,{"$f":"IF(ALL_C!C422=\"\",\"\",ALL_C!C422)","v":""},{"$f":"ALL_C!E422","v":0},{"$f":"ALL_C!F422","v":0},{"$f":"ALL_C!G422","v":0},{"$f":"ALL_C!H422","v":0},{"$f":"ALL_C!I422","v":0},{"$f":"ALL_C!J422","v":0},null,null,null,null,null,null,null,null,null,null,null,null,null,""]
[1,null,40,10,{"$f":"IF(ALL_C!C423=\"\",\"\",ALL_C!C423)","v":""},{"$f":"ALL_C!E423","v":0},{"$f":"ALL_C!F423","v":0},{"$f":"ALL_C!G423","v":0},{"$f":"ALL_C!H423","v":0},{"$f":"ALL_C!I423","v":0},{"$f":"ALL_C!J423","v":0},null,null,null,null,null,null,null,null,null,null,null,null,null,""]
[1,null,40,10,{"$f":"IF(ALL_C!C424=\"\",\"\",ALL_C!C424)","v":""},{"$f":"ALL_C!E424","v":0},{"$f":"ALL_C!F424","v":0},{"$f":"ALL_C!G424","v":0},{"$f":"ALL_C!H424","v":0},{"$f":"ALL_C!I424","v":0},{"$f":"ALL_C!J424","v":0},null,null,null,null,null,null,null,null,null,null,null,null,null,""]
[1,null,40,10,{"$f":"IF(ALL_C!C425=\"\",\"\",ALL_C!C425)","v":""},{"$f":"ALL_C!E425","v":0},{"$f":"ALL_C!F425","v":0},{"$f":"ALL_C!G425","v":0},{"$f":"ALL_C!H425","v":0},{"$f":"ALL_C!I425","v":0},{"$f":"ALL_C!J425","v":0},null,null,null,null,null,null,null,null,null,null,null,null,null,""]
[1,null,40,10,{"$f":"IF(ALL_C!C426=\"\",\"\",ALL_C!C426)","v":""},{"$f":"ALL_C!E426","v":0},{"$f":"ALL_C!F426","v":0},{"$f":"ALL_C!G426","v":0},{"$f":"ALL_C!H426","v":0},{"$f":"ALL_C!I426","v":0},{"$f":"ALL_C!J426","v":0},null,null,null,null,null,null,null,null,null,null,null,null,null,""]
[1,null,40,10,{"$f":"IF(ALL_C!C427=\"\",\"\",ALL_C!C427)","v":""},{"$f":"ALL_C!E427","v":0},{"$f":"ALL_C!F427","v":0},{"$f":"ALL_C!G427","v":0},{"$f":"ALL_C!H427","v":0},{"$f":"ALL_C!I427","v":0},{"$f":"ALL_C!J427","v":0},null,null,null,null,null,null,null,null,null,null,null,null,null,""]
[1,null,40,10,{"$f":"IF(ALL_C!C428=\"\",\"\",ALL_C!C428)","v":""},{"$f":"ALL_C!E428","v":0},{"$f":"ALL_C!F428","v":0},{"$f":"ALL_C!G428","v":0},{"$f":"ALL_C!H428","v":0},{"$f":"ALL_C!I428","v":0},{"$f":"ALL_C!J428","v":0},null,null,null,null,null,null,null,null,null,null,null,null,null,""]
[1,null,40,10,{"$f":"IF(ALL_C!C429=\"\",\"\",ALL_C!C429)","v":""},{"$f":"ALL_C!E429","v":0},{"$f":"ALL_C!F429","v":0},{"$f":"ALL_C!G429","v":0},{"$f":"ALL_C!H429","v":0},{"$f":"ALL_C!I429","v":0},{"$f":"ALL_C!J429","v":0},null,null,null,null,null,null,null,null,null,null,null,null,null,""]
[1,null,40,10,{"$f":"IF(ALL_C!C430=\"\",\"\",ALL_C!C430)","v":""},{"$f":"ALL_C!E430","v":0},{"$f":"ALL_C!F430","v":0},{"$f":"ALL_C!G430","v":0},{"$f":"ALL_C!H430","v":0},{"$f":"ALL_C!I430","v":0},{"$f":"ALL_C!J430","v":0},null,null,null,null,null,null,null,null,null,null,null,null,null,""]
[1,null,40,10,{"$f":"IF(ALL_C!C431=\"\",\"\",ALL_C!C431)","v":""},{"$f":"ALL_C!E431","v":0},{"$f":"ALL_C!F431","v":0},{"$f":"ALL_C!G431","v":0},{"$f":"ALL_C!H431","v":0},{"$f":"ALL_C!I431","v":0},{"$f":"ALL_C!J431","v":0},null,null,null,null,null,null,null,null,null,null,null,null,null,""]
[1,null,40,10,{"$f":"IF(ALL_C!C432=\"\",\"\",ALL_C!C432)","v":""},{"$f":"ALL_C!E432","v":0},{"$f":"ALL_C!F432","v":0},{"$f":"ALL_C!G432","v":0},{"$f":"ALL_C!H432","v":0},{"$f":"ALL_C!I432","v":0},{"$f":"ALL_C!J432","v":0},null,null,null,null,null,null,null,null,null,null,null,null,null,{"$f":"IFERROR(E323,\"#ERR\")","v":""}]
[1,null,40,10,{"$f":"IF(ALL_C!C433=\"\",\"\",ALL_C!C433)","v":""},{"$f":"ALL_C!E433","v":0},{"$f":"ALL_C!F433","v":0},{"$f":"ALL_C!G433","v":0},{"$f":"ALL_C!H433","v":0},{"$f":"ALL_C!I433","v":0},{"$f":"ALL_C!J433","v":0},null,null,null,null,null,null,null,null,null,null,null,null,null,""]
[1,null,40,10,{"$f":"IF(ALL_C!C434=\"\",\"\",ALL_C!C434)","v":""},{"$f":"ALL_C!E434","v":0},{"$f":"ALL_C!F434","v":0},{"$f":"ALL_C!G434","v":0},{"$f":"ALL_C!H434","v":0},{"$f":"ALL_C!I434","v":0},{"$f":"ALL_C!J434","v":0},null,null,null,null,null,null,null,null,null,null,null,null,null,""]
[1,null,40,10,{"$f":"IF(ALL_C!C435=\"\",\"\",ALL_C!C435)","v":""},{"$f":"ALL_C!E435","v":0},{"$f":"ALL_C!F435","v":0},{"$f":"ALL_C!G435","v":0},{"$f":"ALL_C!H435","v":0},{"$f":"ALL_C!I435","v":0},{"$f":"ALL_C!J435","v":0},null,null,null,null,null,null,null,null,null,null,null,null,null,""]
[1,null,40,10,{"$f":"IF(ALL_C!C436=\"\",\"\",ALL_C!C436)","v":""},{"$f":"ALL_C!E436","v":0},{"$f":"ALL_C!F436","v":0},{"$f":"ALL_C!G436","v":0},{"$f":"ALL_C!H436","v":0},{"$f":"ALL_C!I436","v":0},{"$f":"ALL_C!J436","v":0},null,null,null,null,null,null,null,null,null,null,null,null,null,""]
[1,null,40,10,{"$f":"IF(ALL_C!C437=\"\",\"\",ALL_C!C437)","v":""},{"$f":"ALL_C!E437","v":0},{"$f":"ALL_C!F437","v":0},{"$f":"ALL_C!G437","v":0},{"$f":"ALL_C!H437","v":0},{"$f":"ALL_C!I437","v":0},{"$f":"ALL_C!J437","v":0},null,null,null,null,null,null,null,null,null,null,null,null,null,""]
[1,null,40,10,{"$f":"IF(ALL_C!C438=\"\",\"\",ALL_C!C438)","v":""},{"$f":"ALL_C!E438","v":0},{"$f":"ALL_C!F438","v":0},{"$f":"ALL_C!G438","v":0},{"$f":"ALL_C!H438","v":0},{"$f":"ALL_C!I438","v":0},{"$f":"ALL_C!J438","v":0},null,null,null,null,null,null,null,null,null,null,null,null,null,""]
[1,null,40,10,{"$f":"IF(ALL_C!C439=\"\",\"\",ALL_C!C439)","v":""},{"$f":"ALL_C!E439","v":0},{"$f":"ALL_C!F439","v":0},{"$f":"ALL_C!G439","v":0},{"$f":"ALL_C!H439","v":0},{"$f":"ALL_C!I439","v":0},{"$f":"ALL_C!J439","v":0},null,null,null,null,null,null,null,null,null,null,null,null,null,""]
[1,null,40,10,{"$f":"IF(ALL_C!C440=\"\",\"\",ALL_C!C440)","v":""},{"$f":"ALL_C!E440","v":0},{"$f":"ALL_C!F440","v":0},{"$f":"ALL_C!G440","v":0},{"$f":"ALL_C!H440","v":0},{"$f":"ALL_C!I440","v":0},{"$f":"ALL_C!J440","v":0},null,null,null,null,null,null,null,null,null,null,null,null,null,""]
[1,null,40,10,{"$f":"IF(ALL_C!C441=\"\",\"\",ALL_C!C441)","v":""},{"$f":"ALL_C!E441","v":0},{"$f":"ALL_C!F441","v":0},{"$f":"ALL_C!G441","v":0},{"$f":"ALL_C!H441","v":0},{"$f":"ALL_C!I441","v":0},{"$f":"ALL_C!J441","v":0},null,null,null,null,null,null,null,null,null,null,null,null,null,""]
[1,null,40,10,{"$f":"IF(ALL_C!C442=\"\",\"\",ALL_C!C442)","v":""},{"$f":"ALL_C!E442","v":0},{"$f":"ALL_C!F442","v":0},{"$f":"ALL_C!G442","v":0},{"$f":"ALL_C!H442","v":0},{"$f":"ALL_C!I442","v":0},{"$f":"ALL_C!J442","v":0},null,null,null,null,null,null,null,null,null,null,null,null,null,""]
[1,null,40,10,{"$f":"IF(ALL_C!C443=\"\",\"\",ALL_C!C443)","v":""},{"$f":"ALL_C!E443","v":0},{"$f":"ALL_C!F443","v":0},{"$f":"ALL_C!G443","v":0},{"$f":"ALL_C!H443","v":0},{"$f":"ALL_C!I443","v":0},{"$f":"ALL_C!J443","v":0},null,null,null,null,null,null,null,null,null,null,null,null,null,""]
[1,null,40,10,{"$f":"IF(ALL_C!C444=\"\",\"\",ALL_C!C444)","v":""},{"$f":"ALL_C!E444","v":0},{"$f":"ALL_C!F444","v":0},{"$f":"ALL_C!G444","v":0},{"$f":"ALL_C!H444","v":0},{"$f":"ALL_C!I444","v":0},{"$f":"ALL_C!J444","v":0},null,null,null,null,null,null,null,null,null,null,null,null,null,""]
[1,null,40,10,{"$f":"IF(ALL_C!C445=\"\",\"\",ALL_C!C445)","v":""},{"$f":"ALL_C!E445","v":0},{"$f":"ALL_C!F445","v":0},{"$f":"ALL_C!G445","v":0},{"$f":"ALL_C!H445","v":0},{"$f":"ALL_C!I445","v":0},{"$f":"ALL_C!J445","v":0},null,null,null,null,null,null,null,null,null,null,null,null,null,""]
[1,null,40,10,{"$f":"IF(ALL_C!C446=\"\",\"\",ALL_C!C446)","v":""},{"$f":"ALL_C!E446","v":0},{"$f":"ALL_C!F446","v":0},{"$f":"ALL_C!G446","v":0},{"$f":"ALL_C!H446","v":0},{"$f":"ALL_C!I446","v":0},{"$f":"ALL_C!J446","v":0},null,null,null,null,null,null,null,null,null,null,null,null,null,""]
[1,null,40,10,{"$f":"IF(ALL_C!C447=\"\",\"\",ALL_C!C447)","v":""},{"$f":"ALL_C!E447","v":0},{"$f":"ALL_C!F447","v":0},{"$f":"ALL_C!G447","v":0},{"$f":"ALL_C!H447","v":0},{"$f":"ALL_C!I447","v":0},{"$f":"ALL_C!J447","v":0},null,null,null,null,null,null,null,null,null,null,null,null,null,""]
[1,null,40,10,{"$f":"IF(ALL_C!C448=\"\",\"\",ALL_C!C448)","v":""},{"$f":"ALL_C!E448","v":0},{"$f":"ALL_C!F448","v":0},{"$f":"ALL_C!G448","v":0},{"$f":"ALL_C!H448","v":0},{"$f":"ALL_C!I448","v":0},{"$f":"ALL_C!J448","v":0},null,null,null,null,null,null,null,null,null,null,null,null,null,""]
[1,null,40,10,{"$f":"IF(ALL_C!C449=\"\",\"\",ALL_C!C449)","v":""},{"$f":"ALL_C!E449","v":0},{"$f":"ALL_C!F449","v":0},{"$f":"ALL_C!G449","v":0},{"$f":"ALL_C!H449","v":0},{"$f":"ALL_C!I449","v":0},{"$f":"ALL_C!J449","v":0},null,null,null,null,null,null,null,null,null,null,null,null,null,""]
[1,null,40,10,{"$f":"IF(ALL_C!C450=\"\",\"\",ALL_C!C450)","v":""},{"$f":"ALL_C!E450","v":0},{"$f":"ALL_C!F450","v":0},{"$f":"ALL_C!G450","v":0},{"$f":"ALL_C!H450","v":0},{"$f":"ALL_C!I450","v":0},{"$f":"ALL_C!J450","v":0},null,null,null,null,null,null,null,null,null,null,null,null,null,""]
[1,null,40,10,{"$f":"IF(ALL_C!C451=\"\",\"\",ALL_C!C451)","v":""},{"$f":"ALL_C!E451","v":0},{"$f":"ALL_C!F451","v":0},{"$f":"ALL_C!G451","v":0},{"$f":"ALL_C!H451","v":0},{"$f":"ALL_C!I451","v":0},{"$f":"ALL_C!J451","v":0},null,null,null,null,null,null,null,null,null,null,null,null,null,""]
[1,null,40,10,{"$f":"IF(ALL_C!C452=\"\",\"\",ALL_C!C452)","v":""},{"$f":"ALL_C!E452","v":0},{"$f":"ALL_C!F452","v":0},{"$f":"ALL_C!G452","v":0},{"$f":"ALL_C!H452","v":0},{"$f":"ALL_C!I452","v":0},{"$f":"ALL_C!J452","v":0},null,null,null,null,null,null,null,null,null,null,null,null,null,""]
[1,null,40,10,{"$f":"IF(ALL_C!C453=\"\",\"\",ALL_C!C453)","v":""},{"$f":"ALL_C!E453","v":0},{"$f":"ALL_C!F453","v":0},{"$f":"ALL_C!G453","v":0},{"$f":"ALL_C!H453","v":0},{"$f":"ALL_C!I453","v":0},{"$f":"ALL_C!J453","v":0},null,null,null,null,null,null,null,null,null,null,null,null,null,""]
[1,null,40,10,{"$f":"IF(ALL_C!C454=\"\",\"\",ALL_C!C454)","v":""},{"$f":"ALL_C!E454","v":0},{"$f":"ALL_C!F454","v":0},{"$f":"ALL_C!G454","v":0},{"$f":"ALL_C!H454","v":0},{"$f":"ALL_C!I454","v":0},{"$f":"ALL_C!J454","v":0},null,null,null,null,null,null,null,null,null,null,null,null,null,""]
[1,null,40,10,{"$f":"IF(ALL_C!C455=\"\",\"\",ALL_C!C455)","v":""},{"$f":"ALL_C!E455","v":0},{"$f":"ALL_C!F455","v":0},{"$f":"ALL_C!G455","v":0},{"$f":"ALL_C!H455","v":0},{"$f":"ALL_C!I455","v":0},{"$f":"ALL_C!J455","v":0},null,null,null,null,null,null,null,null,null,null,null,null,null,""]
[1,null,40,10,{"$f":"IF(ALL_C!C456=\"\",\"\",ALL_C!C456)","v":""},{"$f":"ALL_C!E456","v":0},{"$f":"ALL_C!F456","v":0},{"$f":"ALL_C!G456","v":0},{"$f":"ALL_C!H456","v":0},{"$f":"ALL_C!I456","v":0},{"$f":"ALL_C!J456","v":0},null,null,null,null,null,null,null,null,null,null,null,null,null,""]
[1,null,40,10,{"$f":"IF(ALL_C!C457=\"\",\"\",ALL_C!C457)","v":""},{"$f":"ALL_C!E457","v":0},{"$f":"ALL_C!F457","v":0},{"$f":"ALL_C!G457","v":0},{"$f":"ALL_C!H457","v":0},{"$f":"ALL_C!I457","v":0},{"$f":"ALL_C!J457","v":0},null,null,null,null,null,null,null,null,null,null,null,null,null,""]
[1,null,40,10,{"$f":"IF(ALL_C!C458=\"\",\"\",ALL_C!C458)","v":""},{"$f":"ALL_C!E458","v":0},{"$f":"ALL_C!F458","v":0},{"$f":"ALL_C!G458","v":0},{"$f":"ALL_C!H458","v":0},{"$f":"ALL_C!I458","v":0},{"$f":"ALL_C!J458","v":0},null,null,null,null,null,null,null,null,null,null,null,null,null,""]
[1,null,40,10,{"$f":"IF(ALL_C!C459=\"\",\"\",ALL_C!C459)","v":""},{"$f":"ALL_C!E459","v":0},{"$f":"ALL_C!F459","v":0},{"$f":"ALL_C!G459","v":0},{"$f":"ALL_C!H459","v":0},{"$f":"ALL_C!I459","v":0},{"$f":"ALL_C!J459","v":0},null,null,null,null,null,null,null,null,null,null,null,null,null,""]
[1,null,40,10,{"$f":"IF(ALL_C!C460=\"\",\"\",ALL_C!C460)","v":""},{"$f":"ALL_C!E460","v":0},{"$f":"ALL_C!F460","v":0},{"$f":"ALL_C!G460","v":0},{"$f":"ALL_C!H460","v":0},{"$f":"ALL_C!I460","v":0},{"$f":"ALL_C!J460","v":0},null,null,null,null,null,null,null,null,null,null,null,null,null,""]
[1,null,40,20,{"$f":"IF(ALL_C!C465=\"\",\"\",ALL_C!C465)","v":""},{"$f":"ALL_C!E465","v":0},{"$f":"ALL_C!F465","v":0},{"$f":"ALL_C!G465","v":0},{"$f":"ALL_C!H465","v":0},{"$f":"ALL_C!I465","v":0},{"$f":"ALL_C!J465","v":0},null,null,null,null,null,null,null,null,null,null,null,null,null,""]
[1,null,40,20,{"$f":"IF(ALL_C!C466=\"\",\"\",ALL_C!C466)","v":""},{"$f":"ALL_C!E466","v":0},{"$f":"ALL_C!F466","v":0},{"$f":"ALL_C!G466","v":0},{"$f":"ALL_C!H466","v":0},{"$f":"ALL_C!I466","v":0},{"$f":"ALL_C!J466","v":0},null,null,null,null,null,null,null,null,null,null,null,null,null,""]
[1,null,40,20,{"$f":"IF(ALL_C!C467=\"\",\"\",ALL_C!C467)","v":""},{"$f":"ALL_C!E467","v":0},{"$f":"ALL_C!F467","v":0},{"$f":"ALL_C!G467","v":0},{"$f":"ALL_C!H467","v":0},{"$f":"ALL_C!I467","v":0},{"$f":"ALL_C!J467","v":0},null,null,null,null,null,null,null,null,null,null,null,null,null,""]
[1,null,40,20,{"$f":"IF(ALL_C!C468=\"\",\"\",ALL_C!C468)","v":""},{"$f":"ALL_C!E468","v":0},{"$f":"ALL_C!F468","v":0},{"$f":"ALL_C!G468","v":0},{"$f":"ALL_C!H468","v":0},{"$f":"ALL_C!I468","v":0},{"$f":"ALL_C!J468","v":0},null,null,null,null,null,null,null,null,null,null,null,null,null,""]
[1,null,40,20,{"$f":"IF(ALL_C!C469=\"\",\"\",ALL_C!C469)","v":""},{"$f":"ALL_C!E469","v":0},{"$f":"ALL_C!F469","v":0},{"$f":"ALL_C!G469","v":0},{"$f":"ALL_C!H469","v":0},{"$f":"ALL_C!I469","v":0},{"$f":"ALL_C!J469","v":0},null,null,null,null,null,null,null,null,null,null,null,null,null,""]
[1,null,40,20,{"$f":"IF(ALL_C!C470=\"\",\"\",ALL_C!C470)","v":""},{"$f":"ALL_C!E470","v":0},{"$f":"ALL_C!F470","v":0},{"$f":"ALL_C!G470","v":0},{"$f":"ALL_C!H470","v":0},{"$f":"ALL_C!I470","v":0},{"$f":"ALL_C!J470","v":0},null,null,null,null,null,null,null,null,null,null,null,null,null,""]
[1,null,40,20,{"$f":"IF(ALL_C!C471=\"\",\"\",ALL_C!C471)","v":""},{"$f":"ALL_C!E471","v":0},{"$f":"ALL_C!F471","v":0},{"$f":"ALL_C!G471","v":0},{"$f":"ALL_C!H471","v":0},{"$f":"ALL_C!I471","v":0},{"$f":"ALL_C!J471","v":0},null,null,null,null,null,null,null,null,null,null,null,null,null,""]
[1,null,40,20,{"$f":"IF(ALL_C!C472=\"\",\"\",ALL_C!C472)","v":""},{"$f":"ALL_C!E472","v":0},{"$f":"ALL_C!F472","v":0},{"$f":"ALL_C!G472","v":0},{"$f":"ALL_C!H472","v":0},{"$f":"ALL_C!I472","v":0},{"$f":"ALL_C!J472","v":0},null,null,null,null,null,null,null,null,null,null,null,null,null,""]
[1,null,40,20,{"$f":"IF(ALL_C!C473=\"\",\"\",ALL_C!C473)","v":""},{"$f":"ALL_C!E473","v":0},{"$f":"ALL_C!F473","v":0},{"$f":"ALL_C!G473","v":0},{"$f":"ALL_C!H473","v":0},{"$f":"ALL_C!I473","v":0},{"$f":"ALL_C!J473","v":0},null,null,null,null,null,null,null,null,null,null,null,null,null,""]
[1,null,40,20,{"$f":"IF(ALL_C!C474=\"\",\"\",ALL_C!C474)","v":""},{"$f":"ALL_C!E474","v":0},{"$f":"ALL_C!F474","v":0},{"$f":"ALL_C!G474","v":0},{"$f":"ALL_C!H474","v":0},{"$f":"ALL_C!I474","v":0},{"$f":"ALL_C!J474","v":0},null,null,null,null,null,null,null,null,null,null,null,null,null,""]
[1,null,40,20,{"$f":"IF(ALL_C!C475=\"\",\"\",ALL_C!C475)","v":""},{"$f":"ALL_C!E475","v":0},{"$f":"ALL_C!F475","v":0},{"$f":"ALL_C!G475","v":0},{"$f":"ALL_C!H475","v":0},{"$f":"ALL_C!I475","v":0},{"$f":"ALL_C!J475","v":0},null,null,null,null,null,null,null,null,null,null,null,null,null,""]
[1,null,40,20,{"$f":"IF(ALL_C!C476=\"\",\"\",ALL_C!C476)","v":""},{"$f":"ALL_C!E476","v":0},{"$f":"ALL_C!F476","v":0},{"$f":"ALL_C!G476","v":0},{"$f":"ALL_C!H476","v":0},{"$f":"ALL_C!I476","v":0},{"$f":"ALL_C!J476","v":0},null,null,null,null,null,null,null,null,null,null,null,null,null,""]
[1,null,40,20,{"$f":"IF(ALL_C!C477=\"\",\"\",ALL_C!C477)","v":""},{"$f":"ALL_C!E477","v":0},{"$f":"ALL_C!F477","v":0},{"$f":"ALL_C!G477","v":0},{"$f":"ALL_C!H477","v":0},{"$f":"ALL_C!I477","v":0},{"$f":"ALL_C!J477","v":0},null,null,null,null,null,null,null,null,null,null,null,null,null,""]
[1,null,40,20,{"$f":"IF(ALL_C!C478=\"\",\"\",ALL_C!C478)","v":""},{"$f":"ALL_C!E478","v":0},{"$f":"ALL_C!F478","v":0},{"$f":"ALL_C!G478","v":0},{"$f":"ALL_C!H478","v":0},{"$f":"ALL_C!I478","v":0},{"$f":"ALL_C!J478","v":0},null,null,null,null,null,null,null,null,null,null,null,null,null,""]
[1,null,40,20,{"$f":"IF(ALL_C!C479=\"\",\"\",ALL_C!C479)","v":""},{"$f":"ALL_C!E479","v":0},{"$f":"ALL_C!F479","v":0},{"$f":"ALL_C!G479","v":0},{"$f":"ALL_C!H479","v":0},{"$f":"ALL_C!I479","v":0},{"$f":"ALL_C!J479","v":0},null,null,null,null,null,null,null,null,null,null,null,null,null,""]
[1,null,40,20,{"$f":"IF(ALL_C!C480=\"\",\"\",ALL_C!C480)","v":""},{"$f":"ALL_C!E480","v":0},{"$f":"ALL_C!F480","v":0},{"$f":"ALL_C!G480","v":0},{"$f":"ALL_C!H480","v":0},{"$f":"ALL_C!I480","v":0},{"$f":"ALL_C!J480","v":0},null,null,null,null,null,null,null,null,null,null,null,null,null,""]
[1,null,40,20,{"$f":"IF(ALL_C!C481=\"\",\"\",ALL_C!C481)","v":""},{"$f":"ALL_C!E481","v":0},{"$f":"ALL_C!F481","v":0},{"$f":"ALL_C!G481","v":0},{"$f":"ALL_C!H481","v":0},{"$f":"ALL_C!I481","v":0},{"$f":"ALL_C!J481","v":0},null,null,null,null,null,null,null,null,null,null,null,null,null,""]
[1,null,40,20,{"$f":"IF(ALL_C!C482=\"\",\"\",ALL_C!C482)","v":""},{"$f":"ALL_C!E482","v":0},{"$f":"ALL_C!F482","v":0},{"$f":"ALL_C!G482","v":0},{"$f":"ALL_C!H482","v":0},{"$f":"ALL_C!I482","v":0},{"$f":"ALL_C!J482","v":0},null,null,null,null,null,null,null,null,null,null,null,null,null,""]
[1,null,40,20,{"$f":"IF(ALL_C!C483=\"\",\"\",ALL_C!C483)","v":""},{"$f":"ALL_C!E483","v":0},{"$f":"ALL_C!F483","v":0},{"$f":"ALL_C!G483","v":0},{"$f":"ALL_C!H483","v":0},{"$f":"ALL_C!I483","v":0},{"$f":"ALL_C!J483","v":0},null,null,null,null,null,null,null,null,null,null,null,null,null,""]
[1,null,40,20,{"$f":"IF(ALL_C!C484=\"\",\"\",ALL_C!C484)","v":""},{"$f":"ALL_C!E484","v":0},{"$f":"ALL_C!F484","v":0},{"$f":"ALL_C!G484","v":0},{"$f":"ALL_C!H484","v":0},{"$f":"ALL_C!I484","v":0},{"$f":"ALL_C!J484","v":0},null,null,null,null,null,null,null,null,null,null,null,null,null,""]
[1,null,40,20,{"$f":"IF(ALL_C!C485=\"\",\"\",ALL_C!C485)","v":""},{"$f":"ALL_C!E485","v":0},{"$f":"ALL_C!F485","v":0},{"$f":"ALL_C!G485","v":0},{"$f":"ALL_C!H485","v":0},{"$f":"ALL_C!I485","v":0},{"$f":"ALL_C!J485","v":0},null,null,null,null,null,null,null,null,null,null,null,null,null,""]
[1,null,40,20,{"$f":"IF(ALL_C!C486=\"\",\"\",ALL_C!C486)","v":""},{"$f":"ALL_C!E486","v":0},{"$f":"ALL_C!F486","v":0},{"$f":"ALL_C!G486","v":0},{"$f":"ALL_C!H486","v":0},{"$f":"ALL_C!I486","v":0},{"$f":"ALL_C!J486","v":0},null,null,null,null,null,null,null,null,null,null,null,null,null,""]
[1,null,40,20,{"$f":"IF(ALL_C!C487=\"\",\"\",ALL_C!C487)","v":""},{"$f":"ALL_C!E487","v":0},{"$f":"ALL_C!F487","v":0},{"$f":"ALL_C!G487","v":0},{"$f":"ALL_C!H487","v":0},{"$f":"ALL_C!I487","v":0},{"$f":"ALL_C!J487","v":0},null,null,null,null,null,null,null,null,null,null,null,null,null,""]
[1,null,40,20,{"$f":"IF(ALL_C!C488=\"\",\"\",ALL_C!C488)","v":""},{"$f":"ALL_C!E488","v":0},{"$f":"ALL_C!F488","v":0},{"$f":"ALL_C!G488","v":0},{"$f":"ALL_C!H488","v":0},{"$f":"ALL_C!I488","v":0},{"$f":"ALL_C!J488","v":0},null,null,null,null,null,null,null,null,null,null,null,null,null,""]
[1,null,40,20,{"$f":"IF(ALL_C!C489=\"\",\"\",ALL_C!C489)","v":""},{"$f":"ALL_C!E489","v":0},{"$f":"ALL_C!F489","v":0},{"$f":"ALL_C!G489","v":0},{"$f":"ALL_C!H489","v":0},{"$f":"ALL_C!I489","v":0},{"$f":"ALL_C!J489","v":0},null,null,null,null,null,null,null,null,null,null,null,null,null,""]
[1,null,40,20,{"$f":"IF(ALL_C!C490=\"\",\"\",ALL_C!C490)","v":""},{"$f":"ALL_C!E490","v":0},{"$f":"ALL_C!F490","v":0},{"$f":"ALL_C!G490","v":0},{"$f":"ALL_C!H490","v":0},{"$f":"ALL_C!I490","v":0},{"$f":"ALL_C!J490","v":0},null,null,null,null,null,null,null,null,null,null,null,null,null,""]
[1,null,40,20,{"$f":"IF(ALL_C!C491=\"\",\"\",ALL_C!C491)","v":""},{"$f":"ALL_C!E491","v":0},{"$f":"ALL_C!F491","v":0},{"$f":"ALL_C!G491","v":0},{"$f":"ALL_C!H491","v":0},{"$f":"ALL_C!I491","v":0},{"$f":"ALL_C!J491","v":0},null,null,null,null,null,null,null,null,null,null,null,null,null,""]
[1,null,40,20,{"$f":"IF(ALL_C!C492=\"\",\"\",ALL_C!C492)","v":""},{"$f":"ALL_C!E492","v":0},{"$f":"ALL_C!F492","v":0},{"$f":"ALL_C!G492","v":0},{"$f":"ALL_C!H492","v":0},{"$f":"ALL_C!I492","v":0},{"$f":"ALL_C!J492","v":0},null,null,null,null,null,null,null,null,null,null,null,null,null,""]
[1,null,40,20,{"$f":"IF(ALL_C!C493=\"\",\"\",ALL_C!C493)","v":""},{"$f":"ALL_C!E493","v":0},{"$f":"ALL_C!F493","v":0},{"$f":"ALL_C!G493","v":0},{"$f":"ALL_C!H493","v":0},{"$f":"ALL_C!I493","v":0},{"$f":"ALL_C!J493","v":0},null,null,null,null,null,null,null,null,null,null,null,null,null,""]
[1,null,40,20,{"$f":"IF(ALL_C!C494=\"\",\"\",ALL_C!C494)","v":""},{"$f":"ALL_C!E494","v":0},{"$f":"ALL_C!F494","v":0},{"$f":"ALL_C!G494","v":0},{"$f":"ALL_C!H494","v":0},{"$f":"ALL_C!I494","v":0},{"$f":"ALL_C!J494","v":0},null,null,null,null,null,null,null,null,null,null,null,null,null,""]
[1,null,40,20,{"$f":"IF(ALL_C!C495=\"\",\"\",ALL_C!C495)","v":""},{"$f":"ALL_C!E495","v":0},{"$f":"ALL_C!F495","v":0},{"$f":"ALL_C!G495","v":0},{"$f":"ALL_C!H495","v":0},{"$f":"ALL_C!I495","v":0},{"$f":"ALL_C!J495","v":0},null,null,null,null,null,null,null,null,null,null,null,null,null,""]
[1,null,40,20,{"$f":"IF(ALL_C!C496=\"\",\"\",ALL_C!C496)","v":""},{"$f":"ALL_C!E496","v":0},{"$f":"ALL_C!F496","v":0},{"$f":"ALL_C!G496","v":0},{"$f":"ALL_C!H496","v":0},{"$f":"ALL_C!I496","v":0},{"$f":"ALL_C!J496","v":0},null,null,null,null,null,null,null,null,null,null,null,null,null,""]
[1,null,40,20,{"$f":"IF(ALL_C!C497=\"\",\"\",ALL_C!C497)","v":""},{"$f":"ALL_C!E497","v":0},{"$f":"ALL_C!F497","v":0},{"$f":"ALL_C!G497","v":0},{"$f":"ALL_C!H497","v":0},{"$f":"ALL_C!I497","v":0},{"$f":"ALL_C!J497","v":0},null,null,null,null,null,null,null,null,null,null,null,null,null,""]
[1,null,40,20,{"$f":"IF(ALL_C!C498=\"\",\"\",ALL_C!C498)","v":""},{"$f":"ALL_C!E498","v":0},{"$f":"ALL_C!F498","v":0},{"$f":"ALL_C!G498","v":0},{"$f":"ALL_C!H498","v":0},{"$f":"ALL_C!I498","v":0},{"$f":"ALL_C!J498","v":0},null,null,null,null,null,null,null,null,null,null,null,null,null,""]
[1,null,40,20,{"$f":"IF(ALL_C!C499=\"\",\"\",ALL_C!C499)","v":""},{"$f":"ALL_C!E499","v":0},{"$f":"ALL_C!F499","v":0},{"$f":"ALL_C!G499","v":0},{"$f":"ALL_C!H499","v":0},{"$f":"ALL_C!I499","v":0},{"$f":"ALL_C!J499","v":0},null,null,null,null,null,null,null,null,null,null,null,null,null,""]
[1,null,40,20,{"$f":"IF(ALL_C!C500=\"\",\"\",ALL_C!C500)","v":""},{"$f":"ALL_C!E500","v":0},{"$f":"ALL_C!F500","v":0},{"$f":"ALL_C!G500","v":0},{"$f":"ALL_C!H500","v":0},{"$f":"ALL_C!I500","v":0},{"$f":"ALL_C!J500","v":0},null,null,null,null,null,null,null,null,null,null,null,null,null,{"$f":"IFERROR(E387,\"#ERR\")","v":""}]
[1,null,40,20,{"$f":"IF(ALL_C!C501=\"\",\"\",ALL_C!C501)","v":""},{"$f":"ALL_C!E501","v":0},{"$f":"ALL_C!F501","v":0},{"$f":"ALL_C!G501","v":0},{"$f":"ALL_C!H501","v":0},{"$f":"ALL_C!I501","v":0},{"$f":"ALL_C!J501","v":0},null,null,null,null,null,null,null,null,null,null,null,null,null,""]
[1,null,40,20,{"$f":"IF(ALL_C!C502=\"\",\"\",ALL_C!C502)","v":""},{"$f":"ALL_C!E502","v":0},{"$f":"ALL_C!F502","v":0},{"$f":"ALL_C!G502","v":0},{"$f":"ALL_C!H502","v":0},{"$f":"ALL_C!I502","v":0},{"$f":"ALL_C!J502","v":0},null,null,null,null,null,null,null,null,null,null,null,null,null,""]
[1,null,40,20,{"$f":"IF(ALL_C!C503=\"\",\"\",ALL_C!C503)","v":""},{"$f":"ALL_C!E503","v":0},{"$f":"ALL_C!F503","v":0},{"$f":"ALL_C!G503","v":0},{"$f":"ALL_C!H503","v":0},{"$f":"ALL_C!I503","v":0},{"$f":"ALL_C!J503","v":0},null,null,null,null,null,null,null,null,null,null,null,null,null,""]
[1,null,40,20,{"$f":"IF(ALL_C!C504=\"\",\"\",ALL_C!C504)","v":""},{"$f":"ALL_C!E504","v":0},{"$f":"ALL_C!F504","v":0},{"$f":"ALL_C!G504","v":0},{"$f":"ALL_C!H504","v":0},{"$f":"ALL_C!I504","v":0},{"$f":"ALL_C!J504","v":0},null,null,null,null,null,null,null,null,null,null,null,null,null,""]
[1,null,40,20,{"$f":"IF(ALL_C!C505=\"\",\"\",ALL_C!C505)","v":""},{"$f":"ALL_C!E505","v":0},{"$f":"ALL_C!F505","v":0},{"$f":"ALL_C!G505","v":0},{"$f":"ALL_C!H505","v":0},{"$f":"ALL_C!I505","v":0},{"$f":"ALL_C!J505","v":0},null,null,null,null,null,null,null,null,null,null,null,null,null,""]
[1,null,40,20,{"$f":"IF(ALL_C!C506=\"\",\"\",ALL_C!C506)","v":""},{"$f":"ALL_C!E506","v":0},{"$f":"ALL_C!F506","v":0},{"$f":"ALL_C!G506","v":0},{"$f":"ALL_C!H506","v":0},{"$f":"ALL_C!I506","v":0},{"$f":"ALL_C!J506","v":0},null,null,null,null,null,null,null,null,null,null,null,null,null,""]
[1,null,40,20,{"$f":"IF(ALL_C!C507=\"\",\"\",ALL_C!C507)","v":""},{"$f":"ALL_C!E507","v":0},{"$f":"ALL_C!F507","v":0},{"$f":"ALL_C!G507","v":0},{"$f":"ALL_C!H507","v":0},{"$f":"ALL_C!I507","v":0},{"$f":"ALL_C!J507","v":0},null,null,null,null,null,null,null,null,null,null,null,null,null,""]
[1,null,40,20,{"$f":"IF(ALL_C!C508=\"\",\"\",ALL_C!C508)","v":""},{"$f":"ALL_C!E508","v":0},{"$f":"ALL_C!F508","v":0},{"$f":"ALL_C!G508","v":0},{"$f":"ALL_C!H508","v":0},{"$f":"ALL_C!I508","v":0},{"$f":"ALL_C!J508","v":0},null,null,null,null,null,null,null,null,null,null,null,null,null,""]
[1,null,40,20,{"$f":"IF(ALL_C!C509=\"\",\"\",ALL_C!C509)","v":""},{"$f":"ALL_C!E509","v":0},{"$f":"ALL_C!F509","v":0},{"$f":"ALL_C!G509","v":0},{"$f":"ALL_C!H509","v":0},{"$f":"ALL_C!I509","v":0},{"$f":"ALL_C!J509","v":0},null,null,null,null,null,null,null,null,null,null,null,null,null,""]
[1,null,40,20,{"$f":"IF(ALL_C!C510=\"\",\"\",ALL_C!C510)","v":""},{"$f":"ALL_C!E510","v":0},{"$f":"ALL_C!F510","v":0},{"$f":"ALL_C!G510","v":0},{"$f":"ALL_C!H510","v":0},{"$f":"ALL_C!I510","v":0},{"$f":"ALL_C!J510","v":0},null,null,null,null,null,null,null,null,null,null,null,null,null,""]
[1,null,40,20,{"$f":"IF(ALL_C!C511=\"\",\"\",ALL_C!C511)","v":""},{"$f":"ALL_C!E511","v":0},{"$f":"ALL_C!F511","v":0},{"$f":"ALL_C!G511","v":0},{"$f":"ALL_C!H511","v":0},{"$f":"ALL_C!I511","v":0},{"$f":"ALL_C!J511","v":0},null,null,null,null,null,null,null,null,null,null,null,null,null,""]
[1,null,40,20,{"$f":"IF(ALL_C!C512=\"\",\"\",ALL_C!C512)","v":""},{"$f":"ALL_C!E512","v":0},{"$f":"ALL_C!F512","v":0},{"$f":"ALL_C!G512","v":0},{"$f":"ALL_C!H512","v":0},{"$f":"ALL_C!I512","v":0},{"$f":"ALL_C!J512","v":0},null,null,null,null,null,null,null,null,null,null,null,null,null,""]
[1,null,40,20,{"$f":"IF(ALL_C!C513=\"\",\"\",ALL_C!C513)","v":""},{"$f":"ALL_C!E513","v":0},{"$f":"ALL_C!F513","v":0},{"$f":"ALL_C!G513","v":0},{"$f":"ALL_C!H513","v":0},{"$f":"ALL_C!I513","v":0},{"$f":"ALL_C!J513","v":0},null,null,null,null,null,null,null,null,null,null,null,null,null,""]
[1,null,40,20,{"$f":"IF(ALL_C!C514=\"\",\"\",ALL_C!C514)","v":""},{"$f":"ALL_C!E514","v":0},{"$f":"ALL_C!F514","v":0},{"$f":"ALL_C!G514","v":0},{"$f":"ALL_C!H514","v":0},{"$f":"ALL_C!I514","v":0},{"$f":"ALL_C!J514","v":0},null,null,null,null,null,null,null,null,null,null,null,null,null,""]
[1,null,40,30,{"$f":"IF(ALL_C!C519=\"\",\"\",ALL_C!C519)","v":""},{"$f":"ALL_C!E519","v":0},{"$f":"ALL_C!F519","v":0},{"$f":"ALL_C!G519","v":0},{"$f":"ALL_C!H519","v":0},{"$f":"ALL_C!I519","v":0},{"$f":"ALL_C!J519","v":0},null,null,null,null,null,null,null,null,null,null,null,null,null,""]
[1,null,40,30,{"$f":"IF(ALL_C!C520=\"\",\"\",ALL_C!C520)","v":""},{"$f":"ALL_C!E520","v":0},{"$f":"ALL_C!F520","v":0},{"$f":"ALL_C!G520","v":0},{"$f":"ALL_C!H520","v":0},{"$f":"ALL_C!I520","v":0},{"$f":"ALL_C!J520","v":0},null,null,null,null,null,null,null,null,null,null,null,null,null,""]
[1,null,40,30,{"$f":"IF(ALL_C!C521=\"\",\"\",ALL_C!C521)","v":""},{"$f":"ALL_C!E521","v":0},{"$f":"ALL_C!F521","v":0},{"$f":"ALL_C!G521","v":0},{"$f":"ALL_C!H521","v":0},{"$f":"ALL_C!I521","v":0},{"$f":"ALL_C!J521","v":0},null,null,null,null,null,null,null,null,null,null,null,null,null,""]
[1,null,40,30,{"$f":"IF(ALL_C!C522=\"\",\"\",ALL_C!C522)","v":""},{"$f":"ALL_C!E522","v":0},{"$f":"ALL_C!F522","v":0},{"$f":"ALL_C!G522","v":0},{"$f":"ALL_C!H522","v":0},{"$f":"ALL_C!I522","v":0},{"$f":"ALL_C!J522","v":0},null,null,null,null,null,null,null,null,null,null,null,null,null,""]
[1,null,40,30,{"$f":"IF(ALL_C!C523=\"\",\"\",ALL_C!C523)","v":""},{"$f":"ALL_C!E523","v":0},{"$f":"ALL_C!F523","v":0},{"$f":"ALL_C!G523","v":0},{"$f":"ALL_C!H523","v":0},{"$f":"ALL_C!I523","v":0},{"$f":"ALL_C!J523","v":0},null,null,null,null,null,null,null,null,null,null,null,null,null,""]
[1,null,40,30,{"$f":"IF(ALL_C!C524=\"\",\"\",ALL_C!C524)","v":""},{"$f":"ALL_C!E524","v":0},{"$f":"ALL_C!F524","v":0},{"$f":"ALL_C!G524","v":0},{"$f":"ALL_C!H524","v":0},{"$f":"ALL_C!I524","v":0},{"$f":"ALL_C!J524","v":0},null,null,null,null,null,null,null,null,null,null,null,null,null,""]
[1,null,40,30,{"$f":"IF(ALL_C!C525=\"\",\"\",ALL_C!C525)","v":""},{"$f":"ALL_C!E525","v":0},{"$f":"ALL_C!F525","v":0},{"$f":"ALL_C!G525","v":0},{"$f":"ALL_C!H525","v":0},{"$f":"ALL_C!I525","v":0},{"$f":"ALL_C!J525","v":0},null,null,null,null,null,null,null,null,null,null,null,null,null,""]
[1,null,40,30,{"$f":"IF(ALL_C!C526=\"\",\"\",ALL_C!C526)","v":""},{"$f":"ALL_C!E526","v":0},{"$f":"ALL_C!F526","v":0},{"$f":"ALL_C!G526","v":0},{"$f":"ALL_C!H526","v":0},{"$f":"ALL_C!I526","v":0},{"$f":"ALL_C!J526","v":0},null,null,null,null,null,null,null,null,null,null,null,null,null,""]
[1,null,40,30,{"$f":"IF(ALL_C!C527=\"\",\"\",ALL_C!C527)","v":""},{"$f":"ALL_C!E527","v":0},{"$f":"ALL_C!F527","v":0},{"$f":"ALL_C!G527","v":0},{"$f":"ALL_C!H527","v":0},{"$f":"ALL_C!I527","v":0},{"$f":"ALL_C!J527","v":0},null,null,null,null,null,null,null,null,null,null,null,null,null,""]
[1,null,40,30,{"$f":"IF(ALL_C!C528=\"\",\"\",ALL_C!C528)","v":""},{"$f":"ALL_C!E528","v":0},{"$f":"ALL_C!F528","v":0},{"$f":"ALL_C!G528","v":0},{"$f":"ALL_C!H528","v":0},{"$f":"ALL_C!I528","v":0},{"$f":"ALL_C!J528","v":0},null,null,null,null,null,null,null,null,null,null,null,null,null,""]
[1,null,40,30,{"$f":"IF(ALL_C!C529=\"\",\"\",ALL_C!C529)","v":""},{"$f":"ALL_C!E529","v":0},{"$f":"ALL_C!F529","v":0},{"$f":"ALL_C!G529","v":0},{"$f":"ALL_C!H529","v":0},{"$f":"ALL_C!I529","v":0},{"$f":"ALL_C!J529","v":0},null,null,null,null,null,null,null,null,null,null,null,null,null,""]
[1,null,40,30,{"$f":"IF(ALL_C!C530=\"\",\"\",ALL_C!C530)","v":""},{"$f":"ALL_C!E530","v":0},{"$f":"ALL_C!F530","v":0},{"$f":"ALL_C!G530","v":0},{"$f":"ALL_C!H530","v":0},{"$f":"ALL_C!I530","v":0},{"$f":"ALL_C!J530","v":0},null,null,null,null,null,null,null,null,null,null,null,null,null,""]
[1,null,40,30,{"$f":"IF(ALL_C!C531=\"\",\"\",ALL_C!C531)","v":""},{"$f":"ALL_C!E531","v":0},{"$f":"ALL_C!F531","v":0},{"$f":"ALL_C!G531","v":0},{"$f":"ALL_C!H531","v":0},{"$f":"ALL_C!I531","v":0},{"$f":"ALL_C!J531","v":0},null,null,null,null,null,null,null,null,null,null,null,null,null,""]
[1,null,40,30,{"$f":"IF(ALL_C!C532=\"\",\"\",ALL_C!C532)","v":""},{"$f":"ALL_C!E532","v":0},{"$f":"ALL_C!F532","v":0},{"$f":"ALL_C!G532","v":0},{"$f":"ALL_C!H532","v":0},{"$f":"ALL_C!I532","v":0},{"$f":"ALL_C!J532","v":0},null,null,null,null,null,null,null,null,null,null,null,null,null,""]
[1,null,40,30,{"$f":"IF(ALL_C!C533=\"\",\"\",ALL_C!C533)","v":""},{"$f":"ALL_C!E533","v":0},{"$f":"ALL_C!F533","v":0},{"$f":"ALL_C!G533","v":0},{"$f":"ALL_C!H533","v":0},{"$f":"ALL_C!I533","v":0},{"$f":"ALL_C!J533","v":0},null,null,null,null,null,null,null,null,null,null,null,null,null,""]
[1,null,40,30,{"$f":"IF(ALL_C!C534=\"\",\"\",ALL_C!C534)","v":""},{"$f":"ALL_C!E534","v":0},{"$f":"ALL_C!F534","v":0},{"$f":"ALL_C!G534","v":0},{"$f":"ALL_C!H534","v":0},{"$f":"ALL_C!I534","v":0},{"$f":"ALL_C!J534","v":0},null,null,null,null,null,null,null,null,null,null,null,null,null,""]
[1,null,40,30,{"$f":"IF(ALL_C!C535=\"\",\"\",ALL_C!C535)","v":""},{"$f":"ALL_C!E535","v":0},{"$f":"ALL_C!F535","v":0},{"$f":"ALL_C!G535","v":0},{"$f":"ALL_C!H535","v":0},{"$f":"ALL_C!I535","v":0},{"$f":"ALL_C!J535","v":0},null,null,null,null,null,null,null,null,null,null,null,null,null,""]
[1,null,40,30,{"$f":"IF(ALL_C!C536=\"\",\"\",ALL_C!C536)","v":""},{"$f":"ALL_C!E536","v":0},{"$f":"ALL_C!F536","v":0},{"$f":"ALL_C!G536","v":0},{"$f":"ALL_C!H536","v":0},{"$f":"ALL_C!I536","v":0},{"$f":"ALL_C!J536","v":0},null,null,null,null,null,null,null,null,null,null,null,null,null,""]
[1,null,40,30,{"$f":"IF(ALL_C!C537=\"\",\"\",ALL_C!C537)","v":""},{"$f":"ALL_C!E537","v":0},{"$f":"ALL_C!F537","v":0},{"$f":"ALL_C!G537","v":0},{"$f":"ALL_C!H537","v":0},{"$f":"ALL_C!I537","v":0},{"$f":"ALL_C!J537","v":0},null,null,null,null,null,null,null,null,null,null,null,null,null,""]
[1,null,40,30,{"$f":"IF(ALL_C!C538=\"\",\"\",ALL_C!C538)","v":""},{"$f":"ALL_C!E538","v":0},{"$f":"ALL_C!F538","v":0},{"$f":"ALL_C!G538","v":0},{"$f":"ALL_C!H538","v":0},{"$f":"ALL_C!I538","v":0},{"$f":"ALL_C!J538","v":0},null,null,null,null,null,null,null,null,null,null,null,null,null,""]
[1,null,40,30,{"$f":"IF(ALL_C!C539=\"\",\"\",ALL_C!C539)","v":""},{"$f":"ALL_C!E539","v":0},{"$f":"ALL_C!F539","v":0},{"$f":"ALL_C!G539","v":0},{"$f":"ALL_C!H539","v":0},{"$f":"ALL_C!I539","v":0},{"$f":"ALL_C!J539","v":0},null,null,null,null,null,null,null,null,null,null,null,null,null,""]
[1,null,40,30,{"$f":"IF(ALL_C!C540=\"\",\"\",ALL_C!C540)","v":""},{"$f":"ALL_C!E540","v":0},{"$f":"ALL_C!F540","v":0},{"$f":"ALL_C!G540","v":0},{"$f":"ALL_C!H540","v":0},{"$f":"ALL_C!I540","v":0},{"$f":"ALL_C!J540","v":0},null,null,null,null,null,null,null,null,null,null,null,null,null,""]
[1,null,40,30,{"$f":"IF(ALL_C!C541=\"\",\"\",ALL_C!C541)","v":""},{"$f":"ALL_C!E541","v":0},{"$f":"ALL_C!F541","v":0},{"$f":"ALL_C!G541","v":0},{"$f":"ALL_C!H541","v":0},{"$f":"ALL_C!I541","v":0},{"$f":"ALL_C!J541","v":0},null,null,null,null,null,null,null,null,null,null,null,null,null,""]
[1,null,40,30,{"$f":"IF(ALL_C!C542=\"\",\"\",ALL_C!C542)","v":""},{"$f":"ALL_C!E542","v":0},{"$f":"ALL_C!F542","v":0},{"$f":"ALL_C!G542","v":0},{"$f":"ALL_C!H542","v":0},{"$f":"ALL_C!I542","v":0},{"$f":"ALL_C!J542","v":0},null,null,null,null,null,null,null,null,null,null,null,null,null,""]
[1,null,40,30,{"$f":"IF(ALL_C!C543=\"\",\"\",ALL_C!C543)","v":""},{"$f":"ALL_C!E543","v":0},{"$f":"ALL_C!F543","v":0},{"$f":"ALL_C!G543","v":0},{"$f":"ALL_C!H543","v":0},{"$f":"ALL_C!I543","v":0},{"$f":"ALL_C!J543","v":0},null,null,null,null,null,null,null,null,null,null,null,null,null,""]
[1,null,40,30,{"$f":"IF(ALL_C!C544=\"\",\"\",ALL_C!C544)","v":""},{"$f":"ALL_C!E544","v":0},{"$f":"ALL_C!F544","v":0},{"$f":"ALL_C!G544","v":0},{"$f":"ALL_C!H544","v":0},{"$f":"ALL_C!I544","v":0},{"$f":"ALL_C!J544","v":0},null,null,null,null,null,null,null,null,null,null,null,null,null,""]
[1,null,40,30,{"$f":"IF(ALL_C!C545=\"\",\"\",ALL_C!C545)","v":""},{"$f":"ALL_C!E545","v":0},{"$f":"ALL_C!F545","v":0},{"$f":"ALL_C!G545","v":0},{"$f":"ALL_C!H545","v":0},{"$f":"ALL_C!I545","v":0},{"$f":"ALL_C!J545","v":0},null,null,null,null,null,null,null,null,null,null,null,null,null,""]
[1,null,40,30,{"$f":"IF(ALL_C!C546=\"\",\"\",ALL_C!C546)","v":""},{"$f":"ALL_C!E546","v":0},{"$f":"ALL_C!F546","v":0},{"$f":"ALL_C!G546","v":0},{"$f":"ALL_C!H546","v":0},{"$f":"ALL_C!I546","v":0},{"$f":"ALL_C!J546","v":0},null,null,null,null,null,null,null,null,null,null,null,null,null,""]
[1,null,40,30,{"$f":"IF(ALL_C!C547=\"\",\"\",ALL_C!C547)","v":""},{"$f":"ALL_C!E547","v":0},{"$f":"ALL_C!F547","v":0},{"$f":"ALL_C!G547","v":0},{"$f":"ALL_C!H547","v":0},{"$f":"ALL_C!I547","v":0},{"$f":"ALL_C!J547","v":0},null,null,null,null,null,null,null,null,null,null,null,null,null,""]
[1,null,40,30,{"$f":"IF(ALL_C!C548=\"\",\"\",ALL_C!C548)","v":""},{"$f":"ALL_C!E548","v":0},{"$f":"ALL_C!F548","v":0},{"$f":"ALL_C!G548","v":0},{"$f":"ALL_C!H548","v":0},{"$f":"ALL_C!I548","v":0},{"$f":"ALL_C!J548","v":0},null,null,null,null,null,null,null,null,null,null,null,null,null,""]
[1,null,40,30,{"$f":"IF(ALL_C!C549=\"\",\"\",ALL_C!C549)","v":""},{"$f":"ALL_C!E549","v":0},{"$f":"ALL_C!F549","v":0},{"$f":"ALL_C!G549","v":0},{"$f":"ALL_C!H549","v":0},{"$f":"ALL_C!I549","v":0},{"$f":"ALL_C!J549","v":0},null,null,null,null,null,null,null,null,null,null,null,null,null,""]
[1,null,40,30,{"$f":"IF(ALL_C!C550=\"\",\"\",ALL_C!C550)","v":""},{"$f":"ALL_C!E550","v":0},{"$f":"ALL_C!F550","v":0},{"$f":"ALL_C!G550","v":0},{"$f":"ALL_C!H550","v":0},{"$f":"ALL_C!I550","v":0},{"$f":"ALL_C!J550","v":0},null,null,null,null,null,null,null,null,null,null,null,null,null,""]
[1,null,40,30,{"$f":"IF(ALL_C!C551=\"\",\"\",ALL_C!C551)","v":""},{"$f":"ALL_C!E551","v":0},{"$f":"ALL_C!F551","v":0},{"$f":"ALL_C!G551","v":0},{"$f":"ALL_C!H551","v":0},{"$f":"ALL_C!I551","v":0},{"$f":"ALL_C!J551","v":0},null,null,null,null,null,null,null,null,null,null,null,null,null,""]
[1,null,40,30,{"$f":"IF(ALL_C!C552=\"\",\"\",ALL_C!C552)","v":""},{"$f":"ALL_C!E552","v":0},{"$f":"ALL_C!F552","v":0},{"$f":"ALL_C!G552","v":0},{"$f":"ALL_C!H552","v":0},{"$f":"ALL_C!I552","v":0},{"$f":"ALL_C!J552","v":0},null,null,null,null,null,null,null,null,null,null,null,null,null,""]
[1,null,40,30,{"$f":"IF(ALL_C!C553=\"\",\"\",ALL_C!C553)","v":""},{"$f":"ALL_C!E553","v":0},{"$f":"ALL_C!F553","v":0},{"$f":"ALL_C!G553","v":0},{"$f":"ALL_C!H553","v":0},{"$f":"ALL_C!I553","v":0},{"$f":"ALL_C!J553","v":0},null,null,null,null,null,null,null,null,null,null,null,null,null,""]
[1,null,40,30,{"$f":"IF(ALL_C!C554=\"\",\"\",ALL_C!C554)","v":""},{"$f":"ALL_C!E554","v":0},{"$f":"ALL_C!F554","v":0},{"$f":"ALL_C!G554","v":0},{"$f":"ALL_C!H554","v":0},{"$f":"ALL_C!I554","v":0},{"$f":"ALL_C!J554","v":0},null,null,null,null,null,null,null,null,null,null,null,null,null,""]
[1,null,40,30,{"$f":"IF(ALL_C!C555=\"\",\"\",ALL_C!C555)","v":""},{"$f":"ALL_C!E555","v":0},{"$f":"ALL_C!F555","v":0},{"$f":"ALL_C!G555","v":0},{"$f":"ALL_C!H555","v":0},{"$f":"ALL_C!I555","v":0},{"$f":"ALL_C!J555","v":0},null,null,null,null,null,null,null,null,null,null,null,null,null,""]
[1,null,40,30,{"$f":"IF(ALL_C!C556=\"\",\"\",ALL_C!C556)","v":""},{"$f":"ALL_C!E556","v":0},{"$f":"ALL_C!F556","v":0},{"$f":"ALL_C!G556","v":0},{"$f":"ALL_C!H556","v":0},{"$f":"ALL_C!I556","v":0},{"$f":"ALL_C!J556","v":0},null,null,null,null,null,null,null,null,null,null,null,null,null,""]
[1,null,40,30,{"$f":"IF(ALL_C!C557=\"\",\"\",ALL_C!C557)","v":""},{"$f":"ALL_C!E557","v":0},{"$f":"ALL_C!F557","v":0},{"$f":"ALL_C!G557","v":0},{"$f":"ALL_C!H557","v":0},{"$f":"ALL_C!I557","v":0},{"$f":"ALL_C!J557","v":0},null,null,null,null,null,null,null,null,null,null,null,null,null,""]
[1,null,40,30,{"$f":"IF(ALL_C!C558=\"\",\"\",ALL_C!C558)","v":""},{"$f":"ALL_C!E558","v":0},{"$f":"ALL_C!F558","v":0},{"$f":"ALL_C!G558","v":0},{"$f":"ALL_C!H558","v":0},{"$f":"ALL_C!I558","v":0},{"$f":"ALL_C!J558","v":0},null,null,null,null,null,null,null,null,null,null,null,null,null,""]
[1,null,40,30,{"$f":"IF(ALL_C!C559=\"\",\"\",ALL_C!C559)","v":""},{"$f":"ALL_C!E559","v":0},{"$f":"ALL_C!F559","v":0},{"$f":"ALL_C!G559","v":0},{"$f":"ALL_C!H559","v":0},{"$f":"ALL_C!I559","v":0},{"$f":"ALL_C!J559","v":0},null,null,null,null,null,null,null,null,null,null,null,null,null,""]
[1,null,40,30,{"$f":"IF(ALL_C!C560=\"\",\"\",ALL_C!C560)","v":""},{"$f":"ALL_C!E560","v":0},{"$f":"ALL_C!F560","v":0},{"$f":"ALL_C!G560","v":0},{"$f":"ALL_C!H560","v":0},{"$f":"ALL_C!I560","v":0},{"$f":"ALL_C!J560","v":0},null,null,null,null,null,null,null,null,null,null,null,null,null,""]
[1,null,40,30,{"$f":"IF(ALL_C!C561=\"\",\"\",ALL_C!C561)","v":""},{"$f":"ALL_C!E561","v":0},{"$f":"ALL_C!F561","v":0},{"$f":"ALL_C!G561","v":0},{"$f":"ALL_C!H561","v":0},{"$f":"ALL_C!I561","v":0},{"$f":"ALL_C!J561","v":0},null,null,null,null,null,null,null,null,null,null,null,null,null,""]
[1,null,40,30,{"$f":"IF(ALL_C!C562=\"\",\"\",ALL_C!C562)","v":""},{"$f":"ALL_C!E562","v":0},{"$f":"ALL_C!F562","v":0},{"$f":"ALL_C!G562","v":0},{"$f":"ALL_C!H562","v":0},{"$f":"ALL_C!I562","v":0},{"$f":"ALL_C!J562","v":0},null,null,null,null,null,null,null,null,null,null,null,null,null,""]
[1,null,40,30,{"$f":"IF(ALL_C!C563=\"\",\"\",ALL_C!C563)","v":""},{"$f":"ALL_C!E563","v":0},{"$f":"ALL_C!F563","v":0},{"$f":"ALL_C!G563","v":0},{"$f":"ALL_C!H563","v":0},{"$f":"ALL_C!I563","v":0},{"$f":"ALL_C!J563","v":0},null,null,null,null,null,null,null,null,null,null,null,null,null,""]
[1,null,40,30,{"$f":"IF(ALL_C!C564=\"\",\"\",ALL_C!C564)","v":""},{"$f":"ALL_C!E564","v":0},{"$f":"ALL_C!F564","v":0},{"$f":"ALL_C!G564","v":0},{"$f":"ALL_C!H564","v":0},{"$f":"ALL_C!I564","v":0},{"$f":"ALL_C!J564","v":0},null,null,null,null,null,null,null,null,null,null,null,null,null,""]
[1,null,40,30,{"$f":"IF(ALL_C!C565=\"\",\"\",ALL_C!C565)","v":""},{"$f":"ALL_C!E565","v":0},{"$f":"ALL_C!F565","v":0},{"$f":"ALL_C!G565","v":0},{"$f":"ALL_C!H565","v":0},{"$f":"ALL_C!I565","v":0},{"$f":"ALL_C!J565","v":0},null,null,null,null,null,null,null,null,null,null,null,null,null,""]
[1,null,40,30,{"$f":"IF(ALL_C!C566=\"\",\"\",ALL_C!C566)","v":""},{"$f":"ALL_C!E566","v":0},{"$f":"ALL_C!F566","v":0},{"$f":"ALL_C!G566","v":0},{"$f":"ALL_C!H566","v":0},{"$f":"ALL_C!I566","v":0},{"$f":"ALL_C!J566","v":0},null,null,null,null,null,null,null,null,null,null,null,null,null,""]
[1,null,40,30,{"$f":"IF(ALL_C!C567=\"\",\"\",ALL_C!C567)","v":""},{"$f":"ALL_C!E567","v":0},{"$f":"ALL_C!F567","v":0},{"$f":"ALL_C!G567","v":0},{"$f":"ALL_C!H567","v":0},{"$f":"ALL_C!I567","v":0},{"$f":"ALL_C!J567","v":0},null,null,null,null,null,null,null,null,null,null,null,null,null,""]
[1,null,40,30,{"$f":"IF(ALL_C!C568=\"\",\"\",ALL_C!C568)","v":""},{"$f":"ALL_C!E568","v":0},{"$f":"ALL_C!F568","v":0},{"$f":"ALL_C!G568","v":0},{"$f":"ALL_C!H568","v":0},{"$f":"ALL_C!I568","v":0},{"$f":"ALL_C!J568","v":0},null,null,null,null,null,null,null,null,null,null,null,null,null,{"$f":"IFERROR(E451,\"#ERR\")","v":""}]

{"sheet":"EXP_PREVISIONI_PERSONALE_STD","index":21,"n_rows":13,"n_cols":27,"rows_kept":13,"cut":false,"hidden":true,"merged":[]}
["ID","ID_PROGRAMMA","ID_TIPO_PERSONALE","ANNO","COSTO_ORARIO_MEDIO","METODOLOGIA",null,null,null,"ID","DESCRIZIONE"]
[1,null,1,{"$f":"ALL_C_PERSONALE!$F$14","v":0},{"$f":"ALL_C_PERSONALE!F15","v":0},{"$f":"ALL_C_PERSONALE!D15","v":"  Retribuzione media lorda  \nN. ore lavorative nell'anno"},null,null,null,1,"RICERCATORI /TECNICI",null,15,null,null,null,null,null,null,null,null,null,null,null,{"$f":"IFERROR(SUM(C2:E13),\"#ERR\")","v":48},{"$f":"IFERROR(F2,\"#ERR\")","v":"  Retribuzione media lorda  \nN. ore lavorative nell'anno"},{"$f":"COUNTIF(X:Z,\"#ERR\")","v":0}]
[1,null,1,{"$f":"D2+1","v":1},{"$f":"ALL_C_PERSONALE!G15","v":0},{"$f":"F2","v":"  Retribuzione media lorda  \nN. ore lavorative nell'anno"},null,null,null,2,"OPERAI ED ALTRI",null,16,null,null,null,null,null,null,null,null,null,null,null,null,{"$f":"IFERROR(F3,\"#ERR\")","v":"  Retribuzione media lorda  \nN. ore lavorative nell'anno"}]
[1,null,1,{"$f":"D3+1","v":2},{"$f":"ALL_C_PERSONALE!H15","v":0},{"$f":"F3","v":"  Retribuzione media lorda  \nN. ore lavorative nell'anno"},null,null,null,null,null,null,null,null,null,null,null,null,null,null,null,null,null,null,null,"  Retribuzione media lorda  \nN. ore lavorative nell'anno"]
[1,null,1,{"$f":"D4+1","v":3},{"$f":"ALL_C_PERSONALE!I15","v":0},{"$f":"F4","v":"  Retribuzione media lorda  \nN. ore lavorative nell'anno"},null,null,null,null,null,null,null,null,null,null,null,null,null,null,null,null,null,null,null,"  Retribuzione media lorda  \nN. ore lavorative nell'anno"]
[1,null,1,{"$f":"D5+1","v":4},{"$f":"ALL_C_PERSONALE!J15","v":0},{"$f":"F5","v":"  Retribuzione media lorda  \nN. ore lavorative nell'anno"},null,null,null,null,null,null,null,null,null,null,null,null,null,null,null,null,null,null,null,"  Retribuzione media lorda  \nN. ore lavorative nell'anno"]
[1,null,1,{"$f":"D6+1","v":5},{"$f":"ALL_C_PERSONALE!K15","v":0},"  Retribuzione media lorda  \nN. ore lavorative nell'anno",null,null,null,null,null,null,null,null,null,null,null,null,null,null,null,null,null,null,null,"  Retribuzione media lorda  \nN. ore lavorative nell'anno"]
[1,null,2,{"$f":"D2","v":0},{"$f":"ALL_C_PERSONALE!F16","v":0},"  Retribuzione media lorda  \nN. ore lavorative nell'anno",null,null,null,null,null,null,null,null,null,null,null,null,null,null,null,null,null,null,null,"  Retribuzione media lorda  \nN. ore lavorative nell'anno"]
[1,null,2,{"$f":"D8+1","v":1},{"$f":"ALL_C_PERSONALE!G16","v":0},"  Retribuzione media lorda  \nN. ore lavorative nell'anno",null,null,null,null,null,null,null,null,null,null,null,null,null,null,null,null,null,null,null,"  Retribuzione media lorda  \nN. ore lavorative nell'anno"]
[1,null,2,{"$f":"D9+1","v":2},{"$f":"ALL_C_PERSONALE!H16","v":0},"  Retribuzione media lorda  \nN. ore lavorative nell'anno",null,null,null,null,null,null,null,null,null,null,null,null,null,null,null,null,null,null,null,"  Retribuzione media lorda  \nN. ore lavorative nell'anno"]
[1,null,2,{"$f":"D10+1","v":3},{"$f":"ALL_C_PERSONALE!I16","v":0},"  Retribuzione media lorda  \nN. ore lavorative nell'anno",null,null,null,null,null,null,null,null,null,null,null,null,null,null,null,null,null,null,null,"  Retribuzione media lorda  \nN. ore lavorative nell'anno"]
[1,null,2,{"$f":"D11+1","v":4},{"$f":"ALL_C_PERSONALE!J16","v":0},"  Retribuzione media lorda  \nN. ore lavorative nell'anno",null,null,null,null,null,null,null,null,null,null,null,null,null,null,null,null,null,null,null,"  Retribuzione media lorda  \nN. ore lavorative nell'anno"]
[1,null,2,{"$f":"D12+1","v":5},{"$f":"ALL_C_PERSONALE!K16","v":0},"  Retribuzione media lorda  \nN. ore lavorative nell'anno",null,null,null,null,null,null,null,null,null,null,null,null,null,null,null,null,null,null,null,"  Retribuzione media lorda  \nN. ore lavorative nell'anno"]

{"sheet":"EXP_PREVISIONI_PERSONALE_ANNO","index":22,"n_rows":31,"n_cols":27,"rows_kept":31,"cut":false,"hidden":true,"merged":[]}
["ID","ID_PROGRAMMA","ID_FINALITA_COSTO","ID_TIPO_PERSONALE","ANNO","ORE",null,null,null,"ID","DESCRIZIONE"]
[1,null,10,1,{"$f":"ALL_C_PERSONALE!$F$14","v":0},{"$f":"ALL_C_PERSONALE!F21","v":0},null,null,null,1,"RICERCATORI /TECNICI",null,"ALL_C_PERSONALE!","F",21,null,{"$f":"M2&N2&O2","v":"ALL_C_PERSONALE!F21"},null,null,null,null,null,null,null,null,{"$f":"IFERROR(SUM(C2:F31),\"#ERR\")","v":777},{"$f":"COUNTIF(X:Z,\"#ERR\")","v":0}]
[1,null,10,1,{"$f":"E2+1","v":1},{"$f":"ALL_C_PERSONALE!G21","v":0},null,null,null,2,"OPERAI ED ALTRI",null,"ALL_C_PERSONALE!","G",21,null,{"$f":"M3&N3&O3","v":"ALL_C_PERSONALE!G21"}]
[1,null,10,1,{"$f":"E3+1","v":2},{"$f":"ALL_C_PERSONALE!H21","v":0},null,null,null,null,null,null,"ALL_C_PERSONALE!","H",21,null,"ALL_C_PERSONALE!H21"]
[1,null,10,1,{"$f":"E4+1","v":3},{"$f":"ALL_C_PERSONALE!I21","v":0},null,null,null,"ID","DESCRIZIONE",null,"ALL_C_PERSONALE!","I",21,null,"ALL_C_PERSONALE!I21"]
[1,null,10,1,{"$f":"E5+1","v":4},{"$f":"ALL_C_PERSONALE!J21","v":0},null,null,null,10,"STUDI DI FATTIBILITA' TECNICA",null,"ALL_C_PERSONALE!","J",21,null,"ALL_C_PERSONALE!J21"]
[1,null,10,1,{"$f":"E6+1","v":5},{"$f":"ALL_C_PERSONALE!K21","v":0},null,null,null,20,"RICERCA INDUSTRIALE",null,"ALL_C_PERSONALE!","K",21,null,"ALL_C_PERSONALE!K21"]
[1,null,20,1,{"$f":"E2","v":0},{"$f":"ALL_C_PERSONALE!F22","v":0},null,null,null,30,"SVILUPPO SPERIMENTALE",null,"ALL_C_PERSONALE!",{"$f":"N2","v":"F"},22,null,"ALL_C_PERSONALE!F22"]
[1,null,20,1,{"$f":"E8+1","v":1},{"$f":"ALL_C_PERSONALE!G22","v":0},null,null,null,null,null,null,"ALL_C_PERSONALE!",{"$f":"N3","v":"G"},22,null,"ALL_C_PERSONALE!G22"]
[1,null,20,1,{"$f":"E9+1","v":2},{"$f":"ALL_C_PERSONALE!H22","v":0},null,null,null,null,null,null,"ALL_C_PERSONALE!","H",22,null,"ALL_C_PERSONALE!H22"]
[1,null,20,1,{"$f":"E10+1","v":3},{"$f":"ALL_C_PERSONALE!I22","v":0},null,null,10,1,21,null,"ALL_C_PERSONALE!","I",22,null,"ALL_C_PERSONALE!I22"]
[1,null,20,1,{"$f":"E11+1","v":4},{"$f":"ALL_C_PERSONALE!J22","v":0},null,null,20,1,22,null,"ALL_C_PERSONALE!","J",22,null,"ALL_C_PERSONALE!J22"]
[1,null,20,1,{"$f":"E12+1","v":5},{"$f":"ALL_C_PERSONALE!K22","v":0},null,null,20,2,23,null,"ALL_C_PERSONALE!","K",22,null,"ALL_C_PERSONALE!K22"]
[1,null,20,2,{"$f":"E8","v":0},{"$f":"ALL_C_PERSONALE!F23","v":0},null,null,30,1,24,null,"ALL_C_PERSONALE!","F",23,null,"ALL_C_PERSONALE!F23"]
[1,null,20,2,{"$f":"E14+1","v":1},{"$f":"ALL_C_PERSONALE!G23","v":0},null,null,30,2,25,null,"ALL_C_PERSONALE!","G",23,null,"ALL_C_PERSONALE!G23"]
[1,null,20,2,{"$f":"E15+1","v":2},{"$f":"ALL_C_PERSONALE!H23","v":0},null,null,null,null,null,null,"ALL_C_PERSONALE!","H",23,null,"ALL_C_PERSONALE!H23"]
[1,null,20,2,{"$f":"E16+1","v":3},{"$f":"ALL_C_PERSONALE!I23","v":0},null,null,null,null,null,null,"ALL_C_PERSONALE!","I",23,null,"ALL_C_PERSONALE!I23"]
[1,null,20,2,{"$f":"E17+1","v":4},{"$f":"ALL_C_PERSONALE!J23","v":0},null,null,null,null,null,null,"ALL_C_PERSONALE!","J",23,null,"ALL_C_PERSONALE!J23"]
[1,null,20,2,{"$f":"E18+1","v":5},{"$f":"ALL_C_PERSONALE!K23","v":0},null,null,null,null,null,null,"ALL_C_PERSONALE!","K",23,null,"ALL_C_PERSONALE!K23"]
[1,null,30,1,{"$f":"E14","v":0},{"$f":"ALL_C_PERSONALE!F24","v":0},null,null,null,null,null,null,"ALL_C_PERSONALE!","F",24,null,"ALL_C_PERSONALE!F24"]
[1,null,30,1,{"$f":"E20+1","v":1},{"$f":"ALL_C_PERSONALE!G24","v":0},null,null,null,null,null,null,"ALL_C_PERSONALE!","G",24,null,"ALL_C_PERSONALE!G24"]
[1,null,30,1,{"$f":"E21+1","v":2},{"$f":"ALL_C_PERSONALE!H24","v":0},null,null,null,null,null,null,"ALL_C_PERSONALE!","H",24,null,"ALL_C_PERSONALE!H24"]
[1,null,30,1,{"$f":"E22+1","v":3},{"$f":"ALL_C_PERSONALE!I24","v":0},null,null,null,null,null,null,"ALL_C_PERSONALE!","I",24,null,"ALL_C_PERSONALE!I24"]
[1,null,30,1,{"$f":"E23+1","v":4},{"$f":"ALL_C_PERSONALE!J24","v":0},null,null,null,null,null,null,"ALL_C_PERSONALE!","J",24,null,"ALL_C_PERSONALE!J24"]
[1,null,30,1,{"$f":"E24+1","v":5},{"$f":"ALL_C_PERSONALE!K24","v":0},null,null,null,null,null,null,"ALL_C_PERSONALE!","K",24,null,"ALL_C_PERSONALE!K24"]
[1,null,30,2,{"$f":"E20","v":0},{"$f":"ALL_C_PERSONALE!F25","v":0},null,null,null,null,null,null,"ALL_C_PERSONALE!","F",25,null,"ALL_C_PERSONALE!F25"]
[1,null,30,2,{"$f":"E26+1","v":1},{"$f":"ALL_C_PERSONALE!G25","v":0},null,null,null,null,null,null,"ALL_C_PERSONALE!","G",25,null,"ALL_C_PERSONALE!G25"]
[1,null,30,2,{"$f":"E27+1","v":2},{"$f":"ALL_C_PERSONALE!H25","v":0},null,null,null,null,null,null,"ALL_C_PERSONALE!","H",25,null,"ALL_C_PERSONALE!H25"]
[1,null,30,2,{"$f":"E28+1","v":3},{"$f":"ALL_C_PERSONALE!I25","v":0},null,null,null,null,null,null,"ALL_C_PERSONALE!","I",25,null,"ALL_C_PERSONALE!I25"]
[1,null,30,2,{"$f":"E29+1","v":4},{"$f":"ALL_C_PERSONALE!J25","v":0},null,null,null,null,null,null,"ALL_C_PERSONALE!","J",25,null,"ALL_C_PERSONALE!J25"]
[1,null,30,2,{"$f":"E30+1","v":5},{"$f":"ALL_C_PERSONALE!K25","v":0},null,null,null,null,null,null,"ALL_C_PERSONALE!","K",25,null,"ALL_C_PERSONALE!K25"]

{"sheet":"EXP_PREVIS_PERS_NON_DIP_ANNO","index":23,"n_rows":19,"n_cols":27,"rows_kept":19,"cut":false,"hidden":true,"merged":[]}
["ID","ID_PROGRAMMA","ID_FINALITA_COSTO","ANNO","COSTO",null,null,null,"ID","DESCRIZIONE"]
[1,null,10,{"$f":"ALL_C_PERSONALE!$F$14","v":0},{"$f":"ALL_C_PERSONALE!F41","v":0},null,null,null,10,"STUDI DI FATTIBILITA' TECNICA",null,41,null,null,null,null,null,null,null,null,null,null,null,null,null,{"$f":"IFERROR(SUM(C2:E19),\"#ERR\")","v":405},{"$f":"COUNTIF(X:Z,\"#ERR\")","v":0}]
[1,null,10,{"$f":"D2+1","v":1},{"$f":"ALL_C_PERSONALE!G41","v":0},null,null,null,20,"RICERCA INDUSTRIALE",null,42]
[1,null,10,{"$f":"D3+1","v":2},{"$f":"ALL_C_PERSONALE!H41","v":0},null,null,null,30,"SVILUPPO SPERIMENTALE",null,43]
[1,null,10,{"$f":"D4+1","v":3},{"$f":"ALL_C_PERSONALE!I41","v":0}]
[1,null,10,{"$f":"D5+1","v":4},{"$f":"ALL_C_PERSONALE!J41","v":0}]
[1,null,10,{"$f":"D6+1","v":5},{"$f":"ALL_C_PERSONALE!K41","v":0}]
[1,null,20,{"$f":"D2","v":0},{"$f":"ALL_C_PERSONALE!F42","v":0}]
[1,null,20,{"$f":"D8+1","v":1},{"$f":"ALL_C_PERSONALE!G42","v":0}]
[1,null,20,{"$f":"D9+1","v":2},{"$f":"ALL_C_PERSONALE!H42","v":0}]
[1,null,20,{"$f":"D10+1","v":3},{"$f":"ALL_C_PERSONALE!I42","v":0}]
[1,null,20,{"$f":"D11+1","v":4},{"$f":"ALL_C_PERSONALE!J42","v":0}]
[1,null,20,{"$f":"D12+1","v":5},{"$f":"ALL_C_PERSONALE!K42","v":0}]
[1,null,30,{"$f":"D8","v":0},{"$f":"ALL_C_PERSONALE!F43","v":0}]
[1,null,30,{"$f":"D14+1","v":1},{"$f":"ALL_C_PERSONALE!G43","v":0}]
[1,null,30,{"$f":"D15+1","v":2},{"$f":"ALL_C_PERSONALE!H43","v":0}]
[1,null,30,{"$f":"D16+1","v":3},{"$f":"ALL_C_PERSONALE!I43","v":0}]
[1,null,30,{"$f":"D17+1","v":4},{"$f":"ALL_C_PERSONALE!J43","v":0}]
[1,null,30,{"$f":"D18+1","v":5},{"$f":"ALL_C_PERSONALE!K43","v":0}]

{"sheet":"EXP_PREVIS_PERS_TOT_ORE_ANNO","index":24,"n_rows":7,"n_cols":27,"rows_kept":7,"cut":false,"hidden":true,"merged":[]}
["ID","ID_PROGRAMMA","ANNO","Numero unità"]
[1,null,{"$f":"ALL_C_PERSONALE!$F$14","v":0},{"$f":"ALL_C_PERSONALE!F50","v":0},null,null,null,null,null,null,null,null,null,null,null,null,null,null,null,null,null,null,null,null,null,{"$f":"IFERROR(SUM(C2:D7),\"#ERR\")","v":15},{"$f":"COUNTIF(X:Z,\"#ERR\")","v":0}]
[1,null,{"$f":"C2+1","v":1},{"$f":"ALL_C_PERSONALE!G50","v":0}]
[1,null,{"$f":"C3+1","v":2},{"$f":"ALL_C_PERSONALE!H50","v":0}]
[1,null,{"$f":"C4+1","v":3},{"$f":"ALL_C_PERSONALE!I50","v":0}]
[1,null,{"$f":"C5+1","v":4},{"$f":"ALL_C_PERSONALE!J50","v":0}]
[1,null,{"$f":"C6+1","v":5},{"$f":"ALL_C_PERSONALE!K50","v":0}]

{"sheet":"EXP_PREVIS_PERS_IND_ANNO","index":25,"n_rows":7,"n_cols":27,"rows_kept":7,"cut":false,"hidden":true,"merged":[]}
["ID","ID_PROGRAMMA","ANNO","Numero unità","Costo Totale"]
[1,null,{"$f":"ALL_C_PERSONALE!$F$14","v":0},{"$f":"ALL_C_PERSONALE!F56","v":0},{"$f":"ALL_C_PERSONALE!F57","v":0},null,null,null,null,"Numero unità",56,null,null,null,null,null,null,null,null,null,null,null,null,null,null,{"$f":"IFERROR(SUM(C2:E7),\"#ERR\")","v":15},{"$f":"COUNTIF(X:Z,\"#ERR\")","v":0}]
[1,null,{"$f":"C2+1","v":1},{"$f":"ALL_C_PERSONALE!G56","v":0},{"$f":"ALL_C_PERSONALE!G57","v":0},null,null,null,null,"Costo Totale",57]
[1,null,{"$f":"C3+1","v":2},{"$f":"ALL_C_PERSONALE!H56","v":0},{"$f":"ALL_C_PERSONALE!H57","v":0}]
[1,null,{"$f":"C4+1","v":3},{"$f":"ALL_C_PERSONALE!I56","v":0},{"$f":"ALL_C_PERSONALE!I57","v":0}]
[1,null,{"$f":"C5+1","v":4},{"$f":"ALL_C_PERSONALE!J56","v":0},{"$f":"ALL_C_PERSONALE!J57","v":0}]
[1,null,{"$f":"C6+1","v":5},{"$f":"ALL_C_PERSONALE!K56","v":0},{"$f":"ALL_C_PERSONALE!K57","v":0}]

{"sheet":"EXP_PREVIS_PERS_IND_AMM_ANNO","index":26,"n_rows":13,"n_cols":27,"rows_kept":13,"cut":false,"hidden":true,"merged":[]}
["ID","ID_PROGRAMMA","ID_TIPO_AMMORTAMENTO","ANNO","Costo Totale",null,null,null,null,"ID_TIPO_AMMORTAMENTO","DESCRIZIONE"]
[1,null,10,{"$f":"ALL_C_PERSONALE!$F$14","v":0},{"$f":"ALL_C_PERSONALE!F64","v":0},null,"ALL_C_PERSONALE!","F",null,10,"Beni materiali",null,64,null,null,null,null,null,null,null,null,null,null,null,null,{"$f":"IFERROR(SUM(C2:E13),\"#ERR\")","v":210},{"$f":"COUNTIF(X:Z,\"#ERR\")","v":0}]
[1,null,10,{"$f":"D2+1","v":1},{"$f":"ALL_C_PERSONALE!G64","v":0},null,"ALL_C_PERSONALE!","G",null,20,"Beni immateriali",null,65]
[1,null,10,{"$f":"D3+1","v":2},{"$f":"ALL_C_PERSONALE!H64","v":0},null,"ALL_C_PERSONALE!","H"]
[1,null,10,{"$f":"D4+1","v":3},{"$f":"ALL_C_PERSONALE!I64","v":0},null,"ALL_C_PERSONALE!","I"]
[1,null,10,{"$f":"D5+1","v":4},{"$f":"ALL_C_PERSONALE!J64","v":0},null,"ALL_C_PERSONALE!","J"]
[1,null,10,{"$f":"D6+1","v":5},{"$f":"ALL_C_PERSONALE!K64","v":0},null,"ALL_C_PERSONALE!","K"]
[1,null,20,{"$f":"D2","v":0},{"$f":"ALL_C_PERSONALE!F65","v":0}]
[1,null,20,{"$f":"D8+1","v":1},{"$f":"ALL_C_PERSONALE!G65","v":0}]
[1,null,20,{"$f":"D9+1","v":2},{"$f":"ALL_C_PERSONALE!H65","v":0}]
[1,null,20,{"$f":"D10+1","v":3},{"$f":"ALL_C_PERSONALE!I65","v":0}]
[1,null,20,{"$f":"D11+1","v":4},{"$f":"ALL_C_PERSONALE!J65","v":0}]
[1,null,20,{"$f":"D12+1","v":5},{"$f":"ALL_C_PERSONALE!K65","v":0}]

{"sheet":"EXP_PREVIS_PERS_IND_SPEGEN_ANNO","index":27,"n_rows":31,"n_cols":27,"rows_kept":31,"cut":false,"hidden":true,"merged":[]}
["ID","ID_PROGRAMMA","ID_TIPO_SPESA_GENERALE","ID_TIPO_VOCE_SPESA_GEN","ANNO","Costo Totale",null,null,null,null,"ID_TIPO_SPESA_GENERALE","DESCRIZIONE"]
[1,null,10,"10-00",{"$f":"ALL_C_PERSONALE!$F$14","v":0},{"$f":"ALL_C_PERSONALE!F74","v":0},null,null,null,null,10,"Forniture",null,null,null,null,null,null,null,null,null,null,null,{"$f":"IFERROR(SUM(C2:C31),\"#ERR\")","v":650},{"$f":"IFERROR(D2,\"#ERR\")","v":"10-00"},{"$f":"IFERROR(SUM(E2:F31),\"#ERR\")","v":75},{"$f":"COUNTIF(X:Z,\"#ERR\")","v":0}]
[1,null,10,"10-00",{"$f":"E2+1","v":1},{"$f":"ALL_C_PERSONALE!G74","v":0},null,null,null,null,20,"Manutenzioni",null,null,null,null,null,null,null,null,null,null,null,null,{"$f":"IFERROR(D3,\"#ERR\")","v":"10-00"}]
[1,null,10,"10-00",{"$f":"E3+1","v":2},{"$f":"ALL_C_PERSONALE!H74","v":0},null,null,null,null,30,"Affitti e canoni",null,null,null,null,null,null,null,null,null,null,null,null,"10-00"]
[1,null,10,"10-00",{"$f":"E4+1","v":3},{"$f":"ALL_C_PERSONALE!I74","v":0},null,null,null,null,null,null,null,null,null,null,null,null,null,null,null,null,null,null,"10-00"]
[1,null,10,"10-00",{"$f":"E5+1","v":4},{"$f":"ALL_C_PERSONALE!J74","v":0},null,null,null,null,"ID_TIPO_VOCE_SPESA_GEN","DESCRIZIONE",null,null,null,null,null,null,null,null,null,null,null,null,"10-00"]
[1,null,10,"10-00",{"$f":"E6+1","v":5},{"$f":"ALL_C_PERSONALE!K74","v":0},null,null,null,null,"10-00","Forniture",null,74,null,null,null,null,null,null,null,null,null,null,"10-00"]
[1,null,20,"20-10",{"$f":"E2","v":0},{"$f":"ALL_C_PERSONALE!F77","v":0},null,null,null,null,"20-10","Immobili",null,77,null,null,null,null,null,null,null,null,null,null,"20-10"]
[1,null,20,"20-10",{"$f":"E8+1","v":1},{"$f":"ALL_C_PERSONALE!G77","v":0},null,null,null,null,"20-20","Macchinari - Impianti",null,78,null,null,null,null,null,null,null,null,null,null,"20-10"]
[1,null,20,"20-10",{"$f":"E9+1","v":2},{"$f":"ALL_C_PERSONALE!H77","v":0},null,null,null,null,"30-10","Affitti",null,82,null,null,null,null,null,null,null,null,null,null,"20-10"]
[1,null,20,"20-10",{"$f":"E10+1","v":3},{"$f":"ALL_C_PERSONALE!I77","v":0},null,null,null,null,"30-20","Leasing",null,83,null,null,null,null,null,null,null,null,null,null,"20-10"]
[1,null,20,"20-10",{"$f":"E11+1","v":4},{"$f":"ALL_C_PERSONALE!J77","v":0},null,null,null,null,null,null,null,null,null,null,null,null,null,null,null,null,null,null,"20-10"]
[1,null,20,"20-10",{"$f":"E12+1","v":5},{"$f":"ALL_C_PERSONALE!K77","v":0},null,null,null,null,null,null,null,null,null,null,null,null,null,null,null,null,null,null,"20-10"]
[1,null,20,"20-20",{"$f":"E8","v":0},{"$f":"ALL_C_PERSONALE!F78","v":0},null,null,null,null,null,null,null,null,null,null,null,null,null,null,null,null,null,null,"20-20"]
[1,null,20,"20-20",{"$f":"E14+1","v":1},{"$f":"ALL_C_PERSONALE!G78","v":0},null,null,null,null,null,null,null,null,null,null,null,null,null,null,null,null,null,null,"20-20"]
[1,null,20,"20-20",{"$f":"E15+1","v":2},{"$f":"ALL_C_PERSONALE!H78","v":0},null,null,null,null,null,null,null,null,null,null,null,null,null,null,null,null,null,null,"20-20"]
[1,null,20,"20-20",{"$f":"E16+1","v":3},{"$f":"ALL_C_PERSONALE!I78","v":0},null,null,null,null,null,null,null,null,null,null,null,null,null,null,null,null,null,null,"20-20"]
[1,null,20,"20-20",{"$f":"E17+1","v":4},{"$f":"ALL_C_PERSONALE!J78","v":0},null,null,null,null,null,null,null,null,null,null,null,null,null,null,null,null,null,null,"20-20"]
[1,null,20,"20-20",{"$f":"E18+1","v":5},{"$f":"ALL_C_PERSONALE!K78","v":0},null,null,null,null,null,null,null,null,null,null,null,null,null,null,null,null,null,null,"20-20"]
[1,null,20,"30-10",{"$f":"E14","v":0},{"$f":"ALL_C_PERSONALE!F82","v":0},null,null,null,null,null,null,null,null,null,null,null,null,null,null,null,null,null,null,"30-10"]
[1,null,30,"30-10",{"$f":"E20+1","v":1},{"$f":"ALL_C_PERSONALE!G82","v":0},null,null,null,null,null,null,null,null,null,null,null,null,null,null,null,null,null,null,"30-10"]
[1,null,30,"30-10",{"$f":"E21+1","v":2},{"$f":"ALL_C_PERSONALE!H82","v":0},null,null,null,null,null,null,null,null,null,null,null,null,null,null,null,null,null,null,"30-10"]
[1,null,30,"30-10",{"$f":"E22+1","v":3},{"$f":"ALL_C_PERSONALE!I82","v":0},null,null,null,null,null,null,null,null,null,null,null,null,null,null,null,null,null,null,"30-10"]
[1,null,30,"30-10",{"$f":"E23+1","v":4},{"$f":"ALL_C_PERSONALE!J82","v":0},null,null,null,null,null,null,null,null,null,null,null,null,null,null,null,null,null,null,"30-10"]
[1,null,30,"30-10",{"$f":"E24+1","v":5},{"$f":"ALL_C_PERSONALE!K82","v":0},null,null,null,null,null,null,null,null,null,null,null,null,null,null,null,null,null,null,"30-10"]
[1,null,30,"30-20",{"$f":"E20","v":0},{"$f":"ALL_C_PERSONALE!F83","v":0},null,null,null,null,null,null,null,null,null,null,null,null,null,null,null,null,null,null,"30-20"]
[1,null,30,"30-20",{"$f":"E26+1","v":1},{"$f":"ALL_C_PERSONALE!G83","v":0},null,null,null,null,null,null,null,null,null,null,null,null,null,null,null,null,null,null,"30-20"]
[1,null,30,"30-20",{"$f":"E27+1","v":2},{"$f":"ALL_C_PERSONALE!H83","v":0},null,null,null,null,null,null,null,null,null,null,null,null,null,null,null,null,null,null,"30-20"]
[1,null,30,"30-20",{"$f":"E28+1","v":3},{"$f":"ALL_C_PERSONALE!I83","v":0},null,null,null,null,null,null,null,null,null,null,null,null,null,null,null,null,null,null,"30-20"]
[1,null,30,"30-20",{"$f":"E29+1","v":4},{"$f":"ALL_C_PERSONALE!J83","v":0},null,null,null,null,null,null,null,null,null,null,null,null,null,null,null,null,null,null,"30-20"]
[1,null,30,"30-20",{"$f":"E30+1","v":5},{"$f":"ALL_C_PERSONALE!K83","v":0},null,null,null,null,null,null,null,null,null,null,null,null,null,null,null,null,null,null,"30-20"]

{"sheet":"EXP_PREV_COSTI_IMPRESE_ASS_TIPO","index":28,"n_rows":121,"n_cols":12,"rows_kept":121,"cut":false,"hidden":true,"merged":[]}
["ID","ID_PROGRAMMA_IMPRESA_ASS","IMPRESA_ASSOCIATA_DESC","ID_TIPOLOGIA_COSTO","ANNO 1","ANNO 2","ANNO 3","ANNO OLTRE",null,null,"ID","DESCRIZIONE"]
[1,null,{"$f":"IF(ALL_C_IMPRESE_ASSOCIATE!C15=\"\",\"\",ALL_C_IMPRESE_ASSOCIATE!C15)","v":0},10,{"$f":"ALL_C_IMPRESE_ASSOCIATE!E15","v":0},{"$f":"ALL_C_IMPRESE_ASSOCIATE!F15","v":0},{"$f":"ALL_C_IMPRESE_ASSOCIATE!G15","v":0},{"$f":"ALL_C_IMPRESE_ASSOCIATE!I15","v":0},null,null,10,"PERSONALE"]
[1,null,{"$f":"IF(ALL_C_IMPRESE_ASSOCIATE!C16=\"\",\"\",ALL_C_IMPRESE_ASSOCIATE!C16)","v":""},10,{"$f":"ALL_C_IMPRESE_ASSOCIATE!E16","v":0},{"$f":"ALL_C_IMPRESE_ASSOCIATE!F16","v":0},{"$f":"ALL_C_IMPRESE_ASSOCIATE!G16","v":0},{"$f":"ALL_C_IMPRESE_ASSOCIATE!I16","v":0},null,null,15,"PERSONALE NON DIPENDENTE \n (MAX 15% DEL PERSONALE DIPENDENTE)"]
[1,null,{"$f":"IF(ALL_C_IMPRESE_ASSOCIATE!C17=\"\",\"\",ALL_C_IMPRESE_ASSOCIATE!C17)","v":""},10,{"$f":"ALL_C_IMPRESE_ASSOCIATE!E17","v":0},{"$f":"ALL_C_IMPRESE_ASSOCIATE!F17","v":0},{"$f":"ALL_C_IMPRESE_ASSOCIATE!G17","v":0},{"$f":"ALL_C_IMPRESE_ASSOCIATE!I17","v":0},null,null,20,"MATERIALI"]
[1,null,{"$f":"IF(ALL_C_IMPRESE_ASSOCIATE!C18=\"\",\"\",ALL_C_IMPRESE_ASSOCIATE!C18)","v":""},10,{"$f":"ALL_C_IMPRESE_ASSOCIATE!E18","v":0},{"$f":"ALL_C_IMPRESE_ASSOCIATE!F18","v":0},{"$f":"ALL_C_IMPRESE_ASSOCIATE!G18","v":0},{"$f":"ALL_C_IMPRESE_ASSOCIATE!I18","v":0},null,null,30,"STRUMENTAZIONE ED ATTREZZATURE"]
[1,null,{"$f":"IF(ALL_C_IMPRESE_ASSOCIATE!C19=\"\",\"\",ALL_C_IMPRESE_ASSOCIATE!C19)","v":""},10,{"$f":"ALL_C_IMPRESE_ASSOCIATE!E19","v":0},{"$f":"ALL_C_IMPRESE_ASSOCIATE!F19","v":0},{"$f":"ALL_C_IMPRESE_ASSOCIATE!G19","v":0},{"$f":"ALL_C_IMPRESE_ASSOCIATE!I19","v":0},null,null,40,"SERVIZI DI CONSULENZA"]
[1,null,{"$f":"IF(ALL_C_IMPRESE_ASSOCIATE!C20=\"\",\"\",ALL_C_IMPRESE_ASSOCIATE!C20)","v":""},10,{"$f":"ALL_C_IMPRESE_ASSOCIATE!E20","v":0},{"$f":"ALL_C_IMPRESE_ASSOCIATE!F20","v":0},{"$f":"ALL_C_IMPRESE_ASSOCIATE!G20","v":0},{"$f":"ALL_C_IMPRESE_ASSOCIATE!I20","v":0}]
[1,null,{"$f":"IF(ALL_C_IMPRESE_ASSOCIATE!C21=\"\",\"\",ALL_C_IMPRESE_ASSOCIATE!C21)","v":""},10,{"$f":"ALL_C_IMPRESE_ASSOCIATE!E21","v":0},{"$f":"ALL_C_IMPRESE_ASSOCIATE!F21","v":0},{"$f":"ALL_C_IMPRESE_ASSOCIATE!G21","v":0},{"$f":"ALL_C_IMPRESE_ASSOCIATE!I21","v":0}]
[1,null,{"$f":"IF(ALL_C_IMPRESE_ASSOCIATE!C22=\"\",\"\",ALL_C_IMPRESE_ASSOCIATE!C22)","v":""},10,{"$f":"ALL_C_IMPRESE_ASSOCIATE!E22","v":0},{"$f":"ALL_C_IMPRESE_ASSOCIATE!F22","v":0},{"$f":"ALL_C_IMPRESE_ASSOCIATE!G22","v":0},{"$f":"ALL_C_IMPRESE_ASSOCIATE!I22","v":0}]
[1,null,{"$f":"IF(ALL_C_IMPRESE_ASSOCIATE!C23=\"\",\"\",ALL_C_IMPRESE_ASSOCIATE!C23)","v":""},10,{"$f":"ALL_C_IMPRESE_ASSOCIATE!E23","v":0},{"$f":"ALL_C_IMPRESE_ASSOCIATE!F23","v":0},{"$f":"ALL_C_IMPRESE_ASSOCIATE!G23","v":0},{"$f":"ALL_C_IMPRESE_ASSOCIATE!I23","v":0}]
[1,null,{"$f":"IF(ALL_C_IMPRESE_ASSOCIATE!C24=\"\",\"\",ALL_C_IMPRESE_ASSOCIATE!C24)","v":""},10,{"$f":"ALL_C_IMPRESE_ASSOCIATE!E24","v":0},{"$f":"ALL_C_IMPRESE_ASSOCIATE!F24","v":0},{"$f":"ALL_C_IMPRESE_ASSOCIATE!G24","v":0},{"$f":"ALL_C_IMPRESE_ASSOCIATE!I24","v":0}]
[1,null,{"$f":"IF(ALL_C_IMPRESE_ASSOCIATE!C25=\"\",\"\",ALL_C_IMPRESE_ASSOCIATE!C25)","v":""},10,{"$f":"ALL_C_IMPRESE_ASSOCIATE!E25","v":0},{"$f":"ALL_C_IMPRESE_ASSOCIATE!F25","v":0},{"$f":"ALL_C_IMPRESE_ASSOCIATE!G25","v":0},{"$f":"ALL_C_IMPRESE_ASSOCIATE!I25","v":0}]
[1,null,{"$f":"IF(ALL_C_IMPRESE_ASSOCIATE!C26=\"\",\"\",ALL_C_IMPRESE_ASSOCIATE!C26)","v":""},10,{"$f":"ALL_C_IMPRESE_ASSOCIATE!E26","v":0},{"$f":"ALL_C_IMPRESE_ASSOCIATE!F26","v":0},{"$f":"ALL_C_IMPRESE_ASSOCIATE!G26","v":0},{"$f":"ALL_C_IMPRESE_ASSOCIATE!I26","v":0}]
[1,null,{"$f":"IF(ALL_C_IMPRESE_ASSOCIATE!C27=\"\",\"\",ALL_C_IMPRESE_ASSOCIATE!C27)","v":""},10,{"$f":"ALL_C_IMPRESE_ASSOCIATE!E27","v":0},{"$f":"ALL_C_IMPRESE_ASSOCIATE!F27","v":0},{"$f":"ALL_C_IMPRESE_ASSOCIATE!G27","v":0},{"$f":"ALL_C_IMPRESE_ASSOCIATE!I27","v":0}]
[1,null,{"$f":"IF(ALL_C_IMPRESE_ASSOCIATE!C28=\"\",\"\",ALL_C_IMPRESE_ASSOCIATE!C28)","v":""},10,{"$f":"ALL_C_IMPRESE_ASSOCIATE!E28","v":0},{"$f":"ALL_C_IMPRESE_ASSOCIATE!F28","v":0},{"$f":"ALL_C_IMPRESE_ASSOCIATE!G28","v":0},{"$f":"ALL_C_IMPRESE_ASSOCIATE!I28","v":0}]
[1,null,{"$f":"IF(ALL_C_IMPRESE_ASSOCIATE!C29=\"\",\"\",ALL_C_IMPRESE_ASSOCIATE!C29)","v":""},10,{"$f":"ALL_C_IMPRESE_ASSOCIATE!E29","v":0},{"$f":"ALL_C_IMPRESE_ASSOCIATE!F29","v":0},{"$f":"ALL_C_IMPRESE_ASSOCIATE!G29","v":0},{"$f":"ALL_C_IMPRESE_ASSOCIATE!I29","v":0}]
[1,null,{"$f":"IF(ALL_C_IMPRESE_ASSOCIATE!C30=\"\",\"\",ALL_C_IMPRESE_ASSOCIATE!C30)","v":""},10,{"$f":"ALL_C_IMPRESE_ASSOCIATE!E30","v":0},{"$f":"ALL_C_IMPRESE_ASSOCIATE!F30","v":0},{"$f":"ALL_C_IMPRESE_ASSOCIATE!G30","v":0},{"$f":"ALL_C_IMPRESE_ASSOCIATE!I30","v":0}]
[1,null,{"$f":"IF(ALL_C_IMPRESE_ASSOCIATE!C31=\"\",\"\",ALL_C_IMPRESE_ASSOCIATE!C31)","v":""},10,{"$f":"ALL_C_IMPRESE_ASSOCIATE!E31","v":0},{"$f":"ALL_C_IMPRESE_ASSOCIATE!F31","v":0},{"$f":"ALL_C_IMPRESE_ASSOCIATE!G31","v":0},{"$f":"ALL_C_IMPRESE_ASSOCIATE!I31","v":0}]
[1,null,{"$f":"IF(ALL_C_IMPRESE_ASSOCIATE!C32=\"\",\"\",ALL_C_IMPRESE_ASSOCIATE!C32)","v":""},10,{"$f":"ALL_C_IMPRESE_ASSOCIATE!E32","v":0},{"$f":"ALL_C_IMPRESE_ASSOCIATE!F32","v":0},{"$f":"ALL_C_IMPRESE_ASSOCIATE!G32","v":0},{"$f":"ALL_C_IMPRESE_ASSOCIATE!I32","v":0}]
[1,null,{"$f":"IF(ALL_C_IMPRESE_ASSOCIATE!C33=\"\",\"\",ALL_C_IMPRESE_ASSOCIATE!C33)","v":""},10,{"$f":"ALL_C_IMPRESE_ASSOCIATE!E33","v":0},{"$f":"ALL_C_IMPRESE_ASSOCIATE!F33","v":0},{"$f":"ALL_C_IMPRESE_ASSOCIATE!G33","v":0},{"$f":"ALL_C_IMPRESE_ASSOCIATE!I33","v":0}]
[1,null,{"$f":"IF(ALL_C_IMPRESE_ASSOCIATE!C34=\"\",\"\",ALL_C_IMPRESE_ASSOCIATE!C34)","v":""},10,{"$f":"ALL_C_IMPRESE_ASSOCIATE!E34","v":0},{"$f":"ALL_C_IMPRESE_ASSOCIATE!F34","v":0},{"$f":"ALL_C_IMPRESE_ASSOCIATE!G34","v":0},{"$f":"ALL_C_IMPRESE_ASSOCIATE!I34","v":0}]
[1,null,{"$f":"IF(ALL_C_IMPRESE_ASSOCIATE!C35=\"\",\"\",ALL_C_IMPRESE_ASSOCIATE!C35)","v":""},10,{"$f":"ALL_C_IMPRESE_ASSOCIATE!E35","v":0},{"$f":"ALL_C_IMPRESE_ASSOCIATE!F35","v":0},{"$f":"ALL_C_IMPRESE_ASSOCIATE!G35","v":0},{"$f":"ALL_C_IMPRESE_ASSOCIATE!I35","v":0}]
[1,null,{"$f":"IF(ALL_C_IMPRESE_ASSOCIATE!C36=\"\",\"\",ALL_C_IMPRESE_ASSOCIATE!C36)","v":""},10,{"$f":"ALL_C_IMPRESE_ASSOCIATE!E36","v":0},{"$f":"ALL_C_IMPRESE_ASSOCIATE!F36","v":0},{"$f":"ALL_C_IMPRESE_ASSOCIATE!G36","v":0},{"$f":"ALL_C_IMPRESE_ASSOCIATE!I36","v":0}]
[1,null,{"$f":"IF(ALL_C_IMPRESE_ASSOCIATE!C37=\"\",\"\",ALL_C_IMPRESE_ASSOCIATE!C37)","v":""},10,{"$f":"ALL_C_IMPRESE_ASSOCIATE!E37","v":0},{"$f":"ALL_C_IMPRESE_ASSOCIATE!F37","v":0},{"$f":"ALL_C_IMPRESE_ASSOCIATE!G37","v":0},{"$f":"ALL_C_IMPRESE_ASSOCIATE!I37","v":0}]
[1,null,{"$f":"IF(ALL_C_IMPRESE_ASSOCIATE!C38=\"\",\"\",ALL_C_IMPRESE_ASSOCIATE!C38)","v":""},10,{"$f":"ALL_C_IMPRESE_ASSOCIATE!E38","v":0},{"$f":"ALL_C_IMPRESE_ASSOCIATE!F38","v":0},{"$f":"ALL_C_IMPRESE_ASSOCIATE!G38","v":0},{"$f":"ALL_C_IMPRESE_ASSOCIATE!I38","v":0}]
[1,null,{"$f":"IF(ALL_C_IMPRESE_ASSOCIATE!C39=\"\",\"\",ALL_C_IMPRESE_ASSOCIATE!C39)","v":""},10,{"$f":"ALL_C_IMPRESE_ASSOCIATE!E39","v":0},{"$f":"ALL_C_IMPRESE_ASSOCIATE!F39","v":0},{"$f":"ALL_C_IMPRESE_ASSOCIATE!G39","v":0},{"$f":"ALL_C_IMPRESE_ASSOCIATE!I39","v":0}]
[1,null,{"$f":"IF(ALL_C_IMPRESE_ASSOCIATE!C40=\"\",\"\",ALL_C_IMPRESE_ASSOCIATE!C40)","v":""},10,{"$f":"ALL_C_IMPRESE_ASSOCIATE!E40","v":0},{"$f":"ALL_C_IMPRESE_ASSOCIATE!F40","v":0},{"$f":"ALL_C_IMPRESE_ASSOCIATE!G40","v":0},{"$f":"ALL_C_IMPRESE_ASSOCIATE!I40","v":0}]
[1,null,{"$f":"IF(ALL_C_IMPRESE_ASSOCIATE!C41=\"\",\"\",ALL_C_IMPRESE_ASSOCIATE!C41)","v":""},10,{"$f":"ALL_C_IMPRESE_ASSOCIATE!E41","v":0},{"$f":"ALL_C_IMPRESE_ASSOCIATE!F41","v":0},{"$f":"ALL_C_IMPRESE_ASSOCIATE!G41","v":0},{"$f":"ALL_C_IMPRESE_ASSOCIATE!I41","v":0}]
[1,null,{"$f":"IF(ALL_C_IMPRESE_ASSOCIATE!C42=\"\",\"\",ALL_C_IMPRESE_ASSOCIATE!C42)","v":""},10,{"$f":"ALL_C_IMPRESE_ASSOCIATE!E42","v":0},{"$f":"ALL_C_IMPRESE_ASSOCIATE!F42","v":0},{"$f":"ALL_C_IMPRESE_ASSOCIATE!G42","v":0},{"$f":"ALL_C_IMPRESE_ASSOCIATE!I42","v":0}]
[1,null,{"$f":"IF(ALL_C_IMPRESE_ASSOCIATE!C43=\"\",\"\",ALL_C_IMPRESE_ASSOCIATE!C43)","v":""},10,{"$f":"ALL_C_IMPRESE_ASSOCIATE!E43","v":0},{"$f":"ALL_C_IMPRESE_ASSOCIATE!F43","v":0},{"$f":"ALL_C_IMPRESE_ASSOCIATE!G43","v":0},{"$f":"ALL_C_IMPRESE_ASSOCIATE!I43","v":0}]
[1,null,{"$f":"IF(ALL_C_IMPRESE_ASSOCIATE!C44=\"\",\"\",ALL_C_IMPRESE_ASSOCIATE!C44)","v":""},10,{"$f":"ALL_C_IMPRESE_ASSOCIATE!E44","v":0},{"$f":"ALL_C_IMPRESE_ASSOCIATE!F44","v":0},{"$f":"ALL_C_IMPRESE_ASSOCIATE!G44","v":0},{"$f":"ALL_C_IMPRESE_ASSOCIATE!I44","v":0}]
[1,null,{"$f":"IF(ALL_C_IMPRESE_ASSOCIATE!C47=\"\",\"\",ALL_C_IMPRESE_ASSOCIATE!C47)","v":0},20,{"$f":"ALL_C_IMPRESE_ASSOCIATE!E47","v":0},{"$f":"ALL_C_IMPRESE_ASSOCIATE!F47","v":0},{"$f":"ALL_C_IMPRESE_ASSOCIATE!G47","v":0},{"$f":"ALL_C_IMPRESE_ASSOCIATE!I47","v":0}]
[1,null,{"$f":"IF(ALL_C_IMPRESE_ASSOCIATE!C48=\"\",\"\",ALL_C_IMPRESE_ASSOCIATE!C48)","v":""},20,{"$f":"ALL_C_IMPRESE_ASSOCIATE!E48","v":0},{"$f":"ALL_C_IMPRESE_ASSOCIATE!F48","v":0},{"$f":"ALL_C_IMPRESE_ASSOCIATE!G48","v":0},{"$f":"ALL_C_IMPRESE_ASSOCIATE!I48","v":0}]
[1,null,{"$f":"IF(ALL_C_IMPRESE_ASSOCIATE!C49=\"\",\"\",ALL_C_IMPRESE_ASSOCIATE!C49)","v":""},20,{"$f":"ALL_C_IMPRESE_ASSOCIATE!E49","v":0},{"$f":"ALL_C_IMPRESE_ASSOCIATE!F49","v":0},{"$f":"ALL_C_IMPRESE_ASSOCIATE!G49","v":0},{"$f":"ALL_C_IMPRESE_ASSOCIATE!I49","v":0}]
[1,null,{"$f":"IF(ALL_C_IMPRESE_ASSOCIATE!C50=\"\",\"\",ALL_C_IMPRESE_ASSOCIATE!C50)","v":""},20,{"$f":"ALL_C_IMPRESE_ASSOCIATE!E50","v":0},{"$f":"ALL_C_IMPRESE_ASSOCIATE!F50","v":0},{"$f":"ALL_C_IMPRESE_ASSOCIATE!G50","v":0},{"$f":"ALL_C_IMPRESE_ASSOCIATE!I50","v":0}]
[1,null,{"$f":"IF(ALL_C_IMPRESE_ASSOCIATE!C51=\"\",\"\",ALL_C_IMPRESE_ASSOCIATE!C51)","v":""},20,{"$f":"ALL_C_IMPRESE_ASSOCIATE!E51","v":0},{"$f":"ALL_C_IMPRESE_ASSOCIATE!F51","v":0},{"$f":"ALL_C_IMPRESE_ASSOCIATE!G51","v":0},{"$f":"ALL_C_IMPRESE_ASSOCIATE!I51","v":0}]
[1,null,{"$f":"IF(ALL_C_IMPRESE_ASSOCIATE!C52=\"\",\"\",ALL_C_IMPRESE_ASSOCIATE!C52)","v":""},20,{"$f":"ALL_C_IMPRESE_ASSOCIATE!E52","v":0},{"$f":"ALL_C_IMPRESE_ASSOCIATE!F52","v":0},{"$f":"ALL_C_IMPRESE_ASSOCIATE!G52","v":0},{"$f":"ALL_C_IMPRESE_ASSOCIATE!I52","v":0}]
[1,null,{"$f":"IF(ALL_C_IMPRESE_ASSOCIATE!C53=\"\",\"\",ALL_C_IMPRESE_ASSOCIATE!C53)","v":""},20,{"$f":"ALL_C_IMPRESE_ASSOCIATE!E53","v":0},{"$f":"ALL_C_IMPRESE_ASSOCIATE!F53","v":0},{"$f":"ALL_C_IMPRESE_ASSOCIATE!G53","v":0},{"$f":"ALL_C_IMPRESE_ASSOCIATE!I53","v":0}]
[1,null,{"$f":"IF(ALL_C_IMPRESE_ASSOCIATE!C54=\"\",\"\",ALL_C_IMPRESE_ASSOCIATE!C54)","v":""},20,{"$f":"ALL_C_IMPRESE_ASSOCIATE!E54","v":0},{"$f":"ALL_C_IMPRESE_ASSOCIATE!F54","v":0},{"$f":"ALL_C_IMPRESE_ASSOCIATE!G54","v":0},{"$f":"ALL_C_IMPRESE_ASSOCIATE!I54","v":0}]
[1,null,{"$f":"IF(ALL_C_IMPRESE_ASSOCIATE!C55=\"\",\"\",ALL_C_IMPRESE_ASSOCIATE!C55)","v":""},20,{"$f":"ALL_C_IMPRESE_ASSOCIATE!E55","v":0},{"$f":"ALL_C_IMPRESE_ASSOCIATE!F55","v":0},{"$f":"ALL_C_IMPRESE_ASSOCIATE!G55","v":0},{"$f":"ALL_C_IMPRESE_ASSOCIATE!I55","v":0}]
[1,null,{"$f":"IF(ALL_C_IMPRESE_ASSOCIATE!C56=\"\",\"\",ALL_C_IMPRESE_ASSOCIATE!C56)","v":""},20,{"$f":"ALL_C_IMPRESE_ASSOCIATE!E56","v":0},{"$f":"ALL_C_IMPRESE_ASSOCIATE!F56","v":0},{"$f":"ALL_C_IMPRESE_ASSOCIATE!G56","v":0},{"$f":"ALL_C_IMPRESE_ASSOCIATE!I56","v":0}]
[1,null,{"$f":"IF(ALL_C_IMPRESE_ASSOCIATE!C57=\"\",\"\",ALL_C_IMPRESE_ASSOCIATE!C57)","v":""},20,{"$f":"ALL_C_IMPRESE_ASSOCIATE!E57","v":0},{"$f":"ALL_C_IMPRESE_ASSOCIATE!F57","v":0},{"$f":"ALL_C_IMPRESE_ASSOCIATE!G57","v":0},{"$f":"ALL_C_IMPRESE_ASSOCIATE!I57","v":0}]
[1,null,{"$f":"IF(ALL_C_IMPRESE_ASSOCIATE!C58=\"\",\"\",ALL_C_IMPRESE_ASSOCIATE!C58)","v":""},20,{"$f":"ALL_C_IMPRESE_ASSOCIATE!E58","v":0},{"$f":"ALL_C_IMPRESE_ASSOCIATE!F58","v":0},{"$f":"ALL_C_IMPRESE_ASSOCIATE!G58","v":0},{"$f":"ALL_C_IMPRESE_ASSOCIATE!I58","v":0}]
[1,null,{"$f":"IF(ALL_C_IMPRESE_ASSOCIATE!C59=\"\",\"\",ALL_C_IMPRESE_ASSOCIATE!C59)","v":""},20,{"$f":"ALL_C_IMPRESE_ASSOCIATE!E59","v":0},{"$f":"ALL_C_IMPRESE_ASSOCIATE!F59","v":0},{"$f":"ALL_C_IMPRESE_ASSOCIATE!G59","v":0},{"$f":"ALL_C_IMPRESE_ASSOCIATE!I59","v":0}]
[1,null,{"$f":"IF(ALL_C_IMPRESE_ASSOCIATE!C60=\"\",\"\",ALL_C_IMPRESE_ASSOCIATE!C60)","v":""},20,{"$f":"ALL_C_IMPRESE_ASSOCIATE!E60","v":0},{"$f":"ALL_C_IMPRESE_ASSOCIATE!F60","v":0},{"$f":"ALL_C_IMPRESE_ASSOCIATE!G60","v":0},{"$f":"ALL_C_IMPRESE_ASSOCIATE!I60","v":0}]
[1,null,{"$f":"IF(ALL_C_IMPRESE_ASSOCIATE!C61=\"\",\"\",ALL_C_IMPRESE_ASSOCIATE!C61)","v":""},20,{"$f":"ALL_C_IMPRESE_ASSOCIATE!E61","v":0},{"$f":"ALL_C_IMPRESE_ASSOCIATE!F61","v":0},{"$f":"ALL_C_IMPRESE_ASSOCIATE!G61","v":0},{"$f":"ALL_C_IMPRESE_ASSOCIATE!I61","v":0}]
[1,null,{"$f":"IF(ALL_C_IMPRESE_ASSOCIATE!C62=\"\",\"\",ALL_C_IMPRESE_ASSOCIATE!C62)","v":""},20,{"$f":"ALL_C_IMPRESE_ASSOCIATE!E62","v":0},{"$f":"ALL_C_IMPRESE_ASSOCIATE!F62","v":0},{"$f":"ALL_C_IMPRESE_ASSOCIATE!G62","v":0},{"$f":"ALL_C_IMPRESE_ASSOCIATE!I62","v":0}]
[1,null,{"$f":"IF(ALL_C_IMPRESE_ASSOCIATE!C63=\"\",\"\",ALL_C_IMPRESE_ASSOCIATE!C63)","v":""},20,{"$f":"ALL_C_IMPRESE_ASSOCIATE!E63","v":0},{"$f":"ALL_C_IMPRESE_ASSOCIATE!F63","v":0},{"$f":"ALL_C_IMPRESE_ASSOCIATE!G63","v":0},{"$f":"ALL_C_IMPRESE_ASSOCIATE!I63","v":0}]
[1,null,{"$f":"IF(ALL_C_IMPRESE_ASSOCIATE!C64=\"\",\"\",ALL_C_IMPRESE_ASSOCIATE!C64)","v":""},20,{"$f":"ALL_C_IMPRESE_ASSOCIATE!E64","v":0},{"$f":"ALL_C_IMPRESE_ASSOCIATE!F64","v":0},{"$f":"ALL_C_IMPRESE_ASSOCIATE!G64","v":0},{"$f":"ALL_C_IMPRESE_ASSOCIATE!I64","v":0}]
[1,null,{"$f":"IF(ALL_C_IMPRESE_ASSOCIATE!C65=\"\",\"\",ALL_C_IMPRESE_ASSOCIATE!C65)","v":""},20,{"$f":"ALL_C_IMPRESE_ASSOCIATE!E65","v":0},{"$f":"ALL_C_IMPRESE_ASSOCIATE!F65","v":0},{"$f":"ALL_C_IMPRESE_ASSOCIATE!G65","v":0},{"$f":"ALL_C_IMPRESE_ASSOCIATE!I65","v":0}]
[1,null,{"$f":"IF(ALL_C_IMPRESE_ASSOCIATE!C66=\"\",\"\",ALL_C_IMPRESE_ASSOCIATE!C66)","v":""},20,{"$f":"ALL_C_IMPRESE_ASSOCIATE!E66","v":0},{"$f":"ALL_C_IMPRESE_ASSOCIATE!F66","v":0},{"$f":"ALL_C_IMPRESE_ASSOCIATE!G66","v":0},{"$f":"ALL_C_IMPRESE_ASSOCIATE!I66","v":0}]
[1,null,{"$f":"IF(ALL_C_IMPRESE_ASSOCIATE!C67=\"\",\"\",ALL_C_IMPRESE_ASSOCIATE!C67)","v":""},20,{"$f":"ALL_C_IMPRESE_ASSOCIATE!E67","v":0},{"$f":"ALL_C_IMPRESE_ASSOCIATE!F67","v":0},{"$f":"ALL_C_IMPRESE_ASSOCIATE!G67","v":0},{"$f":"ALL_C_IMPRESE_ASSOCIATE!I67","v":0}]
[1,null,{"$f":"IF(ALL_C_IMPRESE_ASSOCIATE!C68=\"\",\"\",ALL_C_IMPRESE_ASSOCIATE!C68)","v":""},20,{"$f":"ALL_C_IMPRESE_ASSOCIATE!E68","v":0},{"$f":"ALL_C_IMPRESE_ASSOCIATE!F68","v":0},{"$f":"ALL_C_IMPRESE_ASSOCIATE!G68","v":0},{"$f":"ALL_C_IMPRESE_ASSOCIATE!I68","v":0}]
[1,null,{"$f":"IF(ALL_C_IMPRESE_ASSOCIATE!C69=\"\",\"\",ALL_C_IMPRESE_ASSOCIATE!C69)","v":""},20,{"$f":"ALL_C_IMPRESE_ASSOCIATE!E69","v":0},{"$f":"ALL_C_IMPRESE_ASSOCIATE!F69","v":0},{"$f":"ALL_C_IMPRESE_ASSOCIATE!G69","v":0},{"$f":"ALL_C_IMPRESE_ASSOCIATE!I69","v":0}]
[1,null,{"$f":"IF(ALL_C_IMPRESE_ASSOCIATE!C70=\"\",\"\",ALL_C_IMPRESE_ASSOCIATE!C70)","v":""},20,{"$f":"ALL_C_IMPRESE_ASSOCIATE!E70","v":0},{"$f":"ALL_C_IMPRESE_ASSOCIATE!F70","v":0},{"$f":"ALL_C_IMPRESE_ASSOCIATE!G70","v":0},{"$f":"ALL_C_IMPRESE_ASSOCIATE!I70","v":0}]
[1,null,{"$f":"IF(ALL_C_IMPRESE_ASSOCIATE!C71=\"\",\"\",ALL_C_IMPRESE_ASSOCIATE!C71)","v":""},20,{"$f":"ALL_C_IMPRESE_ASSOCIATE!E71","v":0},{"$f":"ALL_C_IMPRESE_ASSOCIATE!F71","v":0},{"$f":"ALL_C_IMPRESE_ASSOCIATE!G71","v":0},{"$f":"ALL_C_IMPRESE_ASSOCIATE!I71","v":0}]
[1,null,{"$f":"IF(ALL_C_IMPRESE_ASSOCIATE!C72=\"\",\"\",ALL_C_IMPRESE_ASSOCIATE!C72)","v":""},20,{"$f":"ALL_C_IMPRESE_ASSOCIATE!E72","v":0},{"$f":"ALL_C_IMPRESE_ASSOCIATE!F72","v":0},{"$f":"ALL_C_IMPRESE_ASSOCIATE!G72","v":0},{"$f":"ALL_C_IMPRESE_ASSOCIATE!I72","v":0}]
[1,null,{"$f":"IF(ALL_C_IMPRESE_ASSOCIATE!C73=\"\",\"\",ALL_C_IMPRESE_ASSOCIATE!C73)","v":""},20,{"$f":"ALL_C_IMPRESE_ASSOCIATE!E73","v":0},{"$f":"ALL_C_IMPRESE_ASSOCIATE!F73","v":0},{"$f":"ALL_C_IMPRESE_ASSOCIATE!G73","v":0},{"$f":"ALL_C_IMPRESE_ASSOCIATE!I73","v":0}]
[1,null,{"$f":"IF(ALL_C_IMPRESE_ASSOCIATE!C74=\"\",\"\",ALL_C_IMPRESE_ASSOCIATE!C74)","v":""},20,{"$f":"ALL_C_IMPRESE_ASSOCIATE!E74","v":0},{"$f":"ALL_C_IMPRESE_ASSOCIATE!F74","v":0},{"$f":"ALL_C_IMPRESE_ASSOCIATE!G74","v":0},{"$f":"ALL_C_IMPRESE_ASSOCIATE!I74","v":0}]
[1,null,{"$f":"IF(ALL_C_IMPRESE_ASSOCIATE!C75=\"\",\"\",ALL_C_IMPRESE_ASSOCIATE!C75)","v":""},20,{"$f":"ALL_C_IMPRESE_ASSOCIATE!E75","v":0},{"$f":"ALL_C_IMPRESE_ASSOCIATE!F75","v":0},{"$f":"ALL_C_IMPRESE_ASSOCIATE!G75","v":0},{"$f":"ALL_C_IMPRESE_ASSOCIATE!I75","v":0}]
[1,null,{"$f":"IF(ALL_C_IMPRESE_ASSOCIATE!C76=\"\",\"\",ALL_C_IMPRESE_ASSOCIATE!C76)","v":""},20,{"$f":"ALL_C_IMPRESE_ASSOCIATE!E76","v":0},{"$f":"ALL_C_IMPRESE_ASSOCIATE!F76","v":0},{"$f":"ALL_C_IMPRESE_ASSOCIATE!G76","v":0},{"$f":"ALL_C_IMPRESE_ASSOCIATE!I76","v":0}]
[1,null,{"$f":"IF(ALL_C_IMPRESE_ASSOCIATE!C79=\"\",\"\",ALL_C_IMPRESE_ASSOCIATE!C79)","v":0},30,{"$f":"ALL_C_IMPRESE_ASSOCIATE!E79","v":0},{"$f":"ALL_C_IMPRESE_ASSOCIATE!F79","v":0},{"$f":"ALL_C_IMPRESE_ASSOCIATE!G79","v":0},{"$f":"ALL_C_IMPRESE_ASSOCIATE!I79","v":0}]
[1,null,{"$f":"IF(ALL_C_IMPRESE_ASSOCIATE!C80=\"\",\"\",ALL_C_IMPRESE_ASSOCIATE!C80)","v":""},30,{"$f":"ALL_C_IMPRESE_ASSOCIATE!E80","v":0},{"$f":"ALL_C_IMPRESE_ASSOCIATE!F80","v":0},{"$f":"ALL_C_IMPRESE_ASSOCIATE!G80","v":0},{"$f":"ALL_C_IMPRESE_ASSOCIATE!I80","v":0}]
[1,null,{"$f":"IF(ALL_C_IMPRESE_ASSOCIATE!C81=\"\",\"\",ALL_C_IMPRESE_ASSOCIATE!C81)","v":""},30,{"$f":"ALL_C_IMPRESE_ASSOCIATE!E81","v":0},{"$f":"ALL_C_IMPRESE_ASSOCIATE!F81","v":0},{"$f":"ALL_C_IMPRESE_ASSOCIATE!G81","v":0},{"$f":"ALL_C_IMPRESE_ASSOCIATE!I81","v":0}]
[1,null,{"$f":"IF(ALL_C_IMPRESE_ASSOCIATE!C82=\"\",\"\",ALL_C_IMPRESE_ASSOCIATE!C82)","v":""},30,{"$f":"ALL_C_IMPRESE_ASSOCIATE!E82","v":0},{"$f":"ALL_C_IMPRESE_ASSOCIATE!F82","v":0},{"$f":"ALL_C_IMPRESE_ASSOCIATE!G82","v":0},{"$f":"ALL_C_IMPRESE_ASSOCIATE!I82","v":0}]
[1,null,{"$f":"IF(ALL_C_IMPRESE_ASSOCIATE!C83=\"\",\"\",ALL_C_IMPRESE_ASSOCIATE!C83)","v":""},30,{"$f":"ALL_C_IMPRESE_ASSOCIATE!E83","v":0},{"$f":"ALL_C_IMPRESE_ASSOCIATE!F83","v":0},{"$f":"ALL_C_IMPRESE_ASSOCIATE!G83","v":0},{"$f":"ALL_C_IMPRESE_ASSOCIATE!I83","v":0}]
[1,null,{"$f":"IF(ALL_C_IMPRESE_ASSOCIATE!C84=\"\",\"\",ALL_C_IMPRESE_ASSOCIATE!C84)","v":""},30,{"$f":"ALL_C_IMPRESE_ASSOCIATE!E84","v":0},{"$f":"ALL_C_IMPRESE_ASSOCIATE!F84","v":0},{"$f":"ALL_C_IMPRESE_ASSOCIATE!G84","v":0},{"$f":"ALL_C_IMPRESE_ASSOCIATE!I84","v":0}]
[1,null,{"$f":"IF(ALL_C_IMPRESE_ASSOCIATE!C85=\"\",\"\",ALL_C_IMPRESE_ASSOCIATE!C85)","v":""},30,{"$f":"ALL_C_IMPRESE_ASSOCIATE!E85","v":0},{"$f":"ALL_C_IMPRESE_ASSOCIATE!F85","v":0},{"$f":"ALL_C_IMPRESE_ASSOCIATE!G85","v":0},{"$f":"ALL_C_IMPRESE_ASSOCIATE!I85","v":0}]
[1,null,{"$f":"IF(ALL_C_IMPRESE_ASSOCIATE!C86=\"\",\"\",ALL_C_IMPRESE_ASSOCIATE!C86)","v":""},30,{"$f":"ALL_C_IMPRESE_ASSOCIATE!E86","v":0},{"$f":"ALL_C_IMPRESE_ASSOCIATE!F86","v":0},{"$f":"ALL_C_IMPRESE_ASSOCIATE!G86","v":0},{"$f":"ALL_C_IMPRESE_ASSOCIATE!I86","v":0}]
[1,null,{"$f":"IF(ALL_C_IMPRESE_ASSOCIATE!C87=\"\",\"\",ALL_C_IMPRESE_ASSOCIATE!C87)","v":""},30,{"$f":"ALL_C_IMPRESE_ASSOCIATE!E87","v":0},{"$f":"ALL_C_IMPRESE_ASSOCIATE!F87","v":0},{"$f":"ALL_C_IMPRESE_ASSOCIATE!G87","v":0},{"$f":"ALL_C_IMPRESE_ASSOCIATE!I87","v":0}]
[1,null,{"$f":"IF(ALL_C_IMPRESE_ASSOCIATE!C88=\"\",\"\",ALL_C_IMPRESE_ASSOCIATE!C88)","v":""},30,{"$f":"ALL_C_IMPRESE_ASSOCIATE!E88","v":0},{"$f":"ALL_C_IMPRESE_ASSOCIATE!F88","v":0},{"$f":"ALL_C_IMPRESE_ASSOCIATE!G88","v":0},{"$f":"ALL_C_IMPRESE_ASSOCIATE!I88","v":0}]
[1,null,{"$f":"IF(ALL_C_IMPRESE_ASSOCIATE!C89=\"\",\"\",ALL_C_IMPRESE_ASSOCIATE!C89)","v":""},30,{"$f":"ALL_C_IMPRESE_ASSOCIATE!E89","v":0},{"$f":"ALL_C_IMPRESE_ASSOCIATE!F89","v":0},{"$f":"ALL_C_IMPRESE_ASSOCIATE!G89","v":0},{"$f":"ALL_C_IMPRESE_ASSOCIATE!I89","v":0}]
[1,null,{"$f":"IF(ALL_C_IMPRESE_ASSOCIATE!C90=\"\",\"\",ALL_C_IMPRESE_ASSOCIATE!C90)","v":""},30,{"$f":"ALL_C_IMPRESE_ASSOCIATE!E90","v":0},{"$f":"ALL_C_IMPRESE_ASSOCIATE!F90","v":0},{"$f":"ALL_C_IMPRESE_ASSOCIATE!G90","v":0},{"$f":"ALL_C_IMPRESE_ASSOCIATE!I90","v":0}]
[1,null,{"$f":"IF(ALL_C_IMPRESE_ASSOCIATE!C91=\"\",\"\",ALL_C_IMPRESE_ASSOCIATE!C91)","v":""},30,{"$f":"ALL_C_IMPRESE_ASSOCIATE!E91","v":0},{"$f":"ALL_C_IMPRESE_ASSOCIATE!F91","v":0},{"$f":"ALL_C_IMPRESE_ASSOCIATE!G91","v":0},{"$f":"ALL_C_IMPRESE_ASSOCIATE!I91","v":0}]
[1,null,{"$f":"IF(ALL_C_IMPRESE_ASSOCIATE!C92=\"\",\"\",ALL_C_IMPRESE_ASSOCIATE!C92)","v":""},30,{"$f":"ALL_C_IMPRESE_ASSOCIATE!E92","v":0},{"$f":"ALL_C_IMPRESE_ASSOCIATE!F92","v":0},{"$f":"ALL_C_IMPRESE_ASSOCIATE!G92","v":0},{"$f":"ALL_C_IMPRESE_ASSOCIATE!I92","v":0}]
[1,null,{"$f":"IF(ALL_C_IMPRESE_ASSOCIATE!C93=\"\",\"\",ALL_C_IMPRESE_ASSOCIATE!C93)","v":""},30,{"$f":"ALL_C_IMPRESE_ASSOCIATE!E93","v":0},{"$f":"ALL_C_IMPRESE_ASSOCIATE!F93","v":0},{"$f":"ALL_C_IMPRESE_ASSOCIATE!G93","v":0},{"$f":"ALL_C_IMPRESE_ASSOCIATE!I93","v":0}]
[1,null,{"$f":"IF(ALL_C_IMPRESE_ASSOCIATE!C94=\"\",\"\",ALL_C_IMPRESE_ASSOCIATE!C94)","v":""},30,{"$f":"ALL_C_IMPRESE_ASSOCIATE!E94","v":0},{"$f":"ALL_C_IMPRESE_ASSOCIATE!F94","v":0},{"$f":"ALL_C_IMPRESE_ASSOCIATE!G94","v":0},{"$f":"ALL_C_IMPRESE_ASSOCIATE!I94","v":0}]
[1,null,{"$f":"IF(ALL_C_IMPRESE_ASSOCIATE!C95=\"\",\"\",ALL_C_IMPRESE_ASSOCIATE!C95)","v":""},30,{"$f":"ALL_C_IMPRESE_ASSOCIATE!E95","v":0},{"$f":"ALL_C_IMPRESE_ASSOCIATE!F95","v":0},{"$f":"ALL_C_IMPRESE_ASSOCIATE!G95","v":0},{"$f":"ALL_C_IMPRESE_ASSOCIATE!I95","v":0}]
[1,null,{"$f":"IF(ALL_C_IMPRESE_ASSOCIATE!C96=\"\",\"\",ALL_C_IMPRESE_ASSOCIATE!C96)","v":""},30,{"$f":"ALL_C_IMPRESE_ASSOCIATE!E96","v":0},{"$f":"ALL_C_IMPRESE_ASSOCIATE!F96","v":0},{"$f":"ALL_C_IMPRESE_ASSOCIATE!G96","v":0},{"$f":"ALL_C_IMPRESE_ASSOCIATE!I96","v":0}]
[1,null,{"$f":"IF(ALL_C_IMPRESE_ASSOCIATE!C97=\"\",\"\",ALL_C_IMPRESE_ASSOCIATE!C97)","v":""},30,{"$f":"ALL_C_IMPRESE_ASSOCIATE!E97","v":0},{"$f":"ALL_C_IMPRESE_ASSOCIATE!F97","v":0},{"$f":"ALL_C_IMPRESE_ASSOCIATE!G97","v":0},{"$f":"ALL_C_IMPRESE_ASSOCIATE!I97","v":0}]
[1,null,{"$f":"IF(ALL_C_IMPRESE_ASSOCIATE!C98=\"\",\"\",ALL_C_IMPRESE_ASSOCIATE!C98)","v":""},30,{"$f":"ALL_C_IMPRESE_ASSOCIATE!E98","v":0},{"$f":"ALL_C_IMPRESE_ASSOCIATE!F98","v":0},{"$f":"ALL_C_IMPRESE_ASSOCIATE!G98","v":0},{"$f":"ALL_C_IMPRESE_ASSOCIATE!I98","v":0}]
[1,null,{"$f":"IF(ALL_C_IMPRESE_ASSOCIATE!C99=\"\",\"\",ALL_C_IMPRESE_ASSOCIATE!C99)","v":""},30,{"$f":"ALL_C_IMPRESE_ASSOCIATE!E99","v":0},{"$f":"ALL_C_IMPRESE_ASSOCIATE!F99","v":0},{"$f":"ALL_C_IMPRESE_ASSOCIATE!G99","v":0},{"$f":"ALL_C_IMPRESE_ASSOCIATE!I99","v":0}]
[1,null,{"$f":"IF(ALL_C_IMPRESE_ASSOCIATE!C100=\"\",\"\",ALL_C_IMPRESE_ASSOCIATE!C100)","v":""},30,{"$f":"ALL_C_IMPRESE_ASSOCIATE!E100","v":0},{"$f":"ALL_C_IMPRESE_ASSOCIATE!F100","v":0},{"$f":"ALL_C_IMPRESE_ASSOCIATE!G100","v":0},{"$f":"ALL_C_IMPRESE_ASSOCIATE!I100","v":0}]
[1,null,{"$f":"IF(ALL_C_IMPRESE_ASSOCIATE!C101=\"\",\"\",ALL_C_IMPRESE_ASSOCIATE!C101)","v":""},30,{"$f":"ALL_C_IMPRESE_ASSOCIATE!E101","v":0},{"$f":"ALL_C_IMPRESE_ASSOCIATE!F101","v":0},{"$f":"ALL_C_IMPRESE_ASSOCIATE!G101","v":0},{"$f":"ALL_C_IMPRESE_ASSOCIATE!I101","v":0}]
[1,null,{"$f":"IF(ALL_C_IMPRESE_ASSOCIATE!C102=\"\",\"\",ALL_C_IMPRESE_ASSOCIATE!C102)","v":""},30,{"$f":"ALL_C_IMPRESE_ASSOCIATE!E102","v":0},{"$f":"ALL_C_IMPRESE_ASSOCIATE!F102","v":0},{"$f":"ALL_C_IMPRESE_ASSOCIATE!G102","v":0},{"$f":"ALL_C_IMPRESE_ASSOCIATE!I102","v":0}]
[1,null,{"$f":"IF(ALL_C_IMPRESE_ASSOCIATE!C103=\"\",\"\",ALL_C_IMPRESE_ASSOCIATE!C103)","v":""},30,{"$f":"ALL_C_IMPRESE_ASSOCIATE!E103","v":0},{"$f":"ALL_C_IMPRESE_ASSOCIATE!F103","v":0},{"$f":"ALL_C_IMPRESE_ASSOCIATE!G103","v":0},{"$f":"ALL_C_IMPRESE_ASSOCIATE!I103","v":0}]
[1,null,{"$f":"IF(ALL_C_IMPRESE_ASSOCIATE!C104=\"\",\"\",ALL_C_IMPRESE_ASSOCIATE!C104)","v":""},30,{"$f":"ALL_C_IMPRESE_ASSOCIATE!E104","v":0},{"$f":"ALL_C_IMPRESE_ASSOCIATE!F104","v":0},{"$f":"ALL_C_IMPRESE_ASSOCIATE!G104","v":0},{"$f":"ALL_C_IMPRESE_ASSOCIATE!I104","v":0}]
[1,null,{"$f":"IF(ALL_C_IMPRESE_ASSOCIATE!C105=\"\",\"\",ALL_C_IMPRESE_ASSOCIATE!C105)","v":""},30,{"$f":"ALL_C_IMPRESE_ASSOCIATE!E105","v":0},{"$f":"ALL_C_IMPRESE_ASSOCIATE!F105","v":0},{"$f":"ALL_C_IMPRESE_ASSOCIATE!G105","v":0},{"$f":"ALL_C_IMPRESE_ASSOCIATE!I105","v":0}]
[1,null,{"$f":"IF(ALL_C_IMPRESE_ASSOCIATE!C106=\"\",\"\",ALL_C_IMPRESE_ASSOCIATE!C106)","v":""},30,{"$f":"ALL_C_IMPRESE_ASSOCIATE!E106","v":0},{"$f":"ALL_C_IMPRESE_ASSOCIATE!F106","v":0},{"$f":"ALL_C_IMPRESE_ASSOCIATE!G106","v":0},{"$f":"ALL_C_IMPRESE_ASSOCIATE!I106","v":0}]
[1,null,{"$f":"IF(ALL_C_IMPRESE_ASSOCIATE!C107=\"\",\"\",ALL_C_IMPRESE_ASSOCIATE!C107)","v":""},30,{"$f":"ALL_C_IMPRESE_ASSOCIATE!E107","v":0},{"$f":"ALL_C_IMPRESE_ASSOCIATE!F107","v":0},{"$f":"ALL_C_IMPRESE_ASSOCIATE!G107","v":0},{"$f":"ALL_C_IMPRESE_ASSOCIATE!I107","v":0}]
[1,null,{"$f":"IF(ALL_C_IMPRESE_ASSOCIATE!C108=\"\",\"\",ALL_C_IMPRESE_ASSOCIATE!C108)","v":""},30,{"$f":"ALL_C_IMPRESE_ASSOCIATE!E108","v":0},{"$f":"ALL_C_IMPRESE_ASSOCIATE!F108","v":0},{"$f":"ALL_C_IMPRESE_ASSOCIATE!G108","v":0},{"$f":"ALL_C_IMPRESE_ASSOCIATE!I108","v":0}]
[1,null,{"$f":"IF(ALL_C_IMPRESE_ASSOCIATE!C111=\"\",\"\",ALL_C_IMPRESE_ASSOCIATE!C111)","v":0},40,{"$f":"ALL_C_IMPRESE_ASSOCIATE!E111","v":0},{"$f":"ALL_C_IMPRESE_ASSOCIATE!F111","v":0},{"$f":"ALL_C_IMPRESE_ASSOCIATE!G111","v":0},{"$f":"ALL_C_IMPRESE_ASSOCIATE!I111","v":0}]
[1,null,{"$f":"IF(ALL_C_IMPRESE_ASSOCIATE!C112=\"\",\"\",ALL_C_IMPRESE_ASSOCIATE!C112)","v":""},40,{"$f":"ALL_C_IMPRESE_ASSOCIATE!E112","v":0},{"$f":"ALL_C_IMPRESE_ASSOCIATE!F112","v":0},{"$f":"ALL_C_IMPRESE_ASSOCIATE!G112","v":0},{"$f":"ALL_C_IMPRESE_ASSOCIATE!I112","v":0}]
[1,null,{"$f":"IF(ALL_C_IMPRESE_ASSOCIATE!C113=\"\",\"\",ALL_C_IMPRESE_ASSOCIATE!C113)","v":""},40,{"$f":"ALL_C_IMPRESE_ASSOCIATE!E113","v":0},{"$f":"ALL_C_IMPRESE_ASSOCIATE!F113","v":0},{"$f":"ALL_C_IMPRESE_ASSOCIATE!G113","v":0},{"$f":"ALL_C_IMPRESE_ASSOCIATE!I113","v":0}]
[1,null,{"$f":"IF(ALL_C_IMPRESE_ASSOCIATE!C114=\"\",\"\",ALL_C_IMPRESE_ASSOCIATE!C114)","v":""},40,{"$f":"ALL_C_IMPRESE_ASSOCIATE!E114","v":0},{"$f":"ALL_C_IMPRESE_ASSOCIATE!F114","v":0},{"$f":"ALL_C_IMPRESE_ASSOCIATE!G114","v":0},{"$f":"ALL_C_IMPRESE_ASSOCIATE!I114","v":0}]
[1,null,{"$f":"IF(ALL_C_IMPRESE_ASSOCIATE!C115=\"\",\"\",ALL_C_IMPRESE_ASSOCIATE!C115)","v":""},40,{"$f":"ALL_C_IMPRESE_ASSOCIATE!E115","v":0},{"$f":"ALL_C_IMPRESE_ASSOCIATE!F115","v":0},{"$f":"ALL_C_IMPRESE_ASSOCIATE!G115","v":0},{"$f":"ALL_C_IMPRESE_ASSOCIATE!I115","v":0}]
[1,null,{"$f":"IF(ALL_C_IMPRESE_ASSOCIATE!C116=\"\",\"\",ALL_C_IMPRESE_ASSOCIATE!C116)","v":""},40,{"$f":"ALL_C_IMPRESE_ASSOCIATE!E116","v":0},{"$f":"ALL_C_IMPRESE_ASSOCIATE!F116","v":0},{"$f":"ALL_C_IMPRESE_ASSOCIATE!G116","v":0},{"$f":"ALL_C_IMPRESE_ASSOCIATE!I116","v":0}]
[1,null,{"$f":"IF(ALL_C_IMPRESE_ASSOCIATE!C117=\"\",\"\",ALL_C_IMPRESE_ASSOCIATE!C117)","v":""},40,{"$f":"ALL_C_IMPRESE_ASSOCIATE!E117","v":0},{"$f":"ALL_C_IMPRESE_ASSOCIATE!F117","v":0},{"$f":"ALL_C_IMPRESE_ASSOCIATE!G117","v":0},{"$f":"ALL_C_IMPRESE_ASSOCIATE!I117","v":0}]
[1,null,{"$f":"IF(ALL_C_IMPRESE_ASSOCIATE!C118=\"\",\"\",ALL_C_IMPRESE_ASSOCIATE!C118)","v":""},40,{"$f":"ALL_C_IMPRESE_ASSOCIATE!E118","v":0},{"$f":"ALL_C_IMPRESE_ASSOCIATE!F118","v":0},{"$f":"ALL_C_IMPRESE_ASSOCIATE!G118","v":0},{"$f":"ALL_C_IMPRESE_ASSOCIATE!I118","v":0}]
[1,null,{"$f":"IF(ALL_C_IMPRESE_ASSOCIATE!C119=\"\",\"\",ALL_C_IMPRESE_ASSOCIATE!C119)","v":""},40,{"$f":"ALL_C_IMPRESE_ASSOCIATE!E119","v":0},{"$f":"ALL_C_IMPRESE_ASSOCIATE!F119","v":0},{"$f":"ALL_C_IMPRESE_ASSOCIATE!G119","v":0},{"$f":"ALL_C_IMPRESE_ASSOCIATE!I119","v":0}]
[1,null,{"$f":"IF(ALL_C_IMPRESE_ASSOCIATE!C120=\"\",\"\",ALL_C_IMPRESE_ASSOCIATE!C120)","v":""},40,{"$f":"ALL_C_IMPRESE_ASSOCIATE!E120","v":0},{"$f":"ALL_C_IMPRESE_ASSOCIATE!F120","v":0},{"$f":"ALL_C_IMPRESE_ASSOCIATE!G120","v":0},{"$f":"ALL_C_IMPRESE_ASSOCIATE!I120","v":0}]
[1,null,{"$f":"IF(ALL_C_IMPRESE_ASSOCIATE!C121=\"\",\"\",ALL_C_IMPRESE_ASSOCIATE!C121)","v":""},40,{"$f":"ALL_C_IMPRESE_ASSOCIATE!E121","v":0},{"$f":"ALL_C_IMPRESE_ASSOCIATE!F121","v":0},{"$f":"ALL_C_IMPRESE_ASSOCIATE!G121","v":0},{"$f":"ALL_C_IMPRESE_ASSOCIATE!I121","v":0}]
[1,null,{"$f":"IF(ALL_C_IMPRESE_ASSOCIATE!C122=\"\",\"\",ALL_C_IMPRESE_ASSOCIATE!C122)","v":""},40,{"$f":"ALL_C_IMPRESE_ASSOCIATE!E122","v":0},{"$f":"ALL_C_IMPRESE_ASSOCIATE!F122","v":0},{"$f":"ALL_C_IMPRESE_ASSOCIATE!G122","v":0},{"$f":"ALL_C_IMPRESE_ASSOCIATE!I122","v":0}]
[1,null,{"$f":"IF(ALL_C_IMPRESE_ASSOCIATE!C123=\"\",\"\",ALL_C_IMPRESE_ASSOCIATE!C123)","v":""},40,{"$f":"ALL_C_IMPRESE_ASSOCIATE!E123","v":0},{"$f":"ALL_C_IMPRESE_ASSOCIATE!F123","v":0},{"$f":"ALL_C_IMPRESE_ASSOCIATE!G123","v":0},{"$f":"ALL_C_IMPRESE_ASSOCIATE!I123","v":0}]
[1,null,{"$f":"IF(ALL_C_IMPRESE_ASSOCIATE!C124=\"\",\"\",ALL_C_IMPRESE_ASSOCIATE!C124)","v":""},40,{"$f":"ALL_C_IMPRESE_ASSOCIATE!E124","v":0},{"$f":"ALL_C_IMPRESE_ASSOCIATE!F124","v":0},{"$f":"ALL_C_IMPRESE_ASSOCIATE!G124","v":0},{"$f":"ALL_C_IMPRESE_ASSOCIATE!I124","v":0}]
[1,null,{"$f":"IF(ALL_C_IMPRESE_ASSOCIATE!C125=\"\",\"\",ALL_C_IMPRESE_ASSOCIATE!C125)","v":""},40,{"$f":"ALL_C_IMPRESE_ASSOCIATE!E125","v":0},{"$f":"ALL_C_IMPRESE_ASSOCIATE!F125","v":0},{"$f":"ALL_C_IMPRESE_ASSOCIATE!G125","v":0},{"$f":"ALL_C_IMPRESE_ASSOCIATE!I125","v":0}]
[1,null,{"$f":"IF(ALL_C_IMPRESE_ASSOCIATE!C126=\"\",\"\",ALL_C_IMPRESE_ASSOCIATE!C126)","v":""},40,{"$f":"ALL_C_IMPRESE_ASSOCIATE!E126","v":0},{"$f":"ALL_C_IMPRESE_ASSOCIATE!F126","v":0},{"$f":"ALL_C_IMPRESE_ASSOCIATE!G126","v":0},{"$f":"ALL_C_IMPRESE_ASSOCIATE!I126","v":0}]
[1,null,{"$f":"IF(ALL_C_IMPRESE_ASSOCIATE!C127=\"\",\"\",ALL_C_IMPRESE_ASSOCIATE!C127)","v":""},40,{"$f":"ALL_C_IMPRESE_ASSOCIATE!E127","v":0},{"$f":"ALL_C_IMPRESE_ASSOCIATE!F127","v":0},{"$f":"ALL_C_IMPRESE_ASSOCIATE!G127","v":0},{"$f":"ALL_C_IMPRESE_ASSOCIATE!I127","v":0}]
[1,null,{"$f":"IF(ALL_C_IMPRESE_ASSOCIATE!C128=\"\",\"\",ALL_C_IMPRESE_ASSOCIATE!C128)","v":""},40,{"$f":"ALL_C_IMPRESE_ASSOCIATE!E128","v":0},{"$f":"ALL_C_IMPRESE_ASSOCIATE!F128","v":0},{"$f":"ALL_C_IMPRESE_ASSOCIATE!G128","v":0},{"$f":"ALL_C_IMPRESE_ASSOCIATE!I128","v":0}]
[1,null,{"$f":"IF(ALL_C_IMPRESE_ASSOCIATE!C129=\"\",\"\",ALL_C_IMPRESE_ASSOCIATE!C129)","v":""},40,{"$f":"ALL_C_IMPRESE_ASSOCIATE!E129","v":0},{"$f":"ALL_C_IMPRESE_ASSOCIATE!F129","v":0},{"$f":"ALL_C_IMPRESE_ASSOCIATE!G129","v":0},{"$f":"ALL_C_IMPRESE_ASSOCIATE!I129","v":0}]
[1,null,{"$f":"IF(ALL_C_IMPRESE_ASSOCIATE!C130=\"\",\"\",ALL_C_IMPRESE_ASSOCIATE!C130)","v":""},40,{"$f":"ALL_C_IMPRESE_ASSOCIATE!E130","v":0},{"$f":"ALL_C_IMPRESE_ASSOCIATE!F130","v":0},{"$f":"ALL_C_IMPRESE_ASSOCIATE!G130","v":0},{"$f":"ALL_C_IMPRESE_ASSOCIATE!I130","v":0}]
[1,null,{"$f":"IF(ALL_C_IMPRESE_ASSOCIATE!C131=\"\",\"\",ALL_C_IMPRESE_ASSOCIATE!C131)","v":""},40,{"$f":"ALL_C_IMPRESE_ASSOCIATE!E131","v":0},{"$f":"ALL_C_IMPRESE_ASSOCIATE!F131","v":0},{"$f":"ALL_C_IMPRESE_ASSOCIATE!G131","v":0},{"$f":"ALL_C_IMPRESE_ASSOCIATE!I131","v":0}]
[1,null,{"$f":"IF(ALL_C_IMPRESE_ASSOCIATE!C132=\"\",\"\",ALL_C_IMPRESE_ASSOCIATE!C132)","v":""},40,{"$f":"ALL_C_IMPRESE_ASSOCIATE!E132","v":0},{"$f":"ALL_C_IMPRESE_ASSOCIATE!F132","v":0},{"$f":"ALL_C_IMPRESE_ASSOCIATE!G132","v":0},{"$f":"ALL_C_IMPRESE_ASSOCIATE!I132","v":0}]
[1,null,{"$f":"IF(ALL_C_IMPRESE_ASSOCIATE!C133=\"\",\"\",ALL_C_IMPRESE_ASSOCIATE!C133)","v":""},40,{"$f":"ALL_C_IMPRESE_ASSOCIATE!E133","v":0},{"$f":"ALL_C_IMPRESE_ASSOCIATE!F133","v":0},{"$f":"ALL_C_IMPRESE_ASSOCIATE!G133","v":0},{"$f":"ALL_C_IMPRESE_ASSOCIATE!I133","v":0}]
[1,null,{"$f":"IF(ALL_C_IMPRESE_ASSOCIATE!C134=\"\",\"\",ALL_C_IMPRESE_ASSOCIATE!C134)","v":""},40,{"$f":"ALL_C_IMPRESE_ASSOCIATE!E134","v":0},{"$f":"ALL_C_IMPRESE_ASSOCIATE!F134","v":0},{"$f":"ALL_C_IMPRESE_ASSOCIATE!G134","v":0},{"$f":"ALL_C_IMPRESE_ASSOCIATE!I134","v":0}]
[1,null,{"$f":"IF(ALL_C_IMPRESE_ASSOCIATE!C135=\"\",\"\",ALL_C_IMPRESE_ASSOCIATE!C135)","v":""},40,{"$f":"ALL_C_IMPRESE_ASSOCIATE!E135","v":0},{"$f":"ALL_C_IMPRESE_ASSOCIATE!F135","v":0},{"$f":"ALL_C_IMPRESE_ASSOCIATE!G135","v":0},{"$f":"ALL_C_IMPRESE_ASSOCIATE!I135","v":0}]
[1,null,{"$f":"IF(ALL_C_IMPRESE_ASSOCIATE!C136=\"\",\"\",ALL_C_IMPRESE_ASSOCIATE!C136)","v":""},40,{"$f":"ALL_C_IMPRESE_ASSOCIATE!E136","v":0},{"$f":"ALL_C_IMPRESE_ASSOCIATE!F136","v":0},{"$f":"ALL_C_IMPRESE_ASSOCIATE!G136","v":0},{"$f":"ALL_C_IMPRESE_ASSOCIATE!I136","v":0}]
[1,null,{"$f":"IF(ALL_C_IMPRESE_ASSOCIATE!C137=\"\",\"\",ALL_C_IMPRESE_ASSOCIATE!C137)","v":""},40,{"$f":"ALL_C_IMPRESE_ASSOCIATE!E137","v":0},{"$f":"ALL_C_IMPRESE_ASSOCIATE!F137","v":0},{"$f":"ALL_C_IMPRESE_ASSOCIATE!G137","v":0},{"$f":"ALL_C_IMPRESE_ASSOCIATE!I137","v":0}]
[1,null,{"$f":"IF(ALL_C_IMPRESE_ASSOCIATE!C138=\"\",\"\",ALL_C_IMPRESE_ASSOCIATE!C138)","v":""},40,{"$f":"ALL_C_IMPRESE_ASSOCIATE!E138","v":0},{"$f":"ALL_C_IMPRESE_ASSOCIATE!F138","v":0},{"$f":"ALL_C_IMPRESE_ASSOCIATE!G138","v":0},{"$f":"ALL_C_IMPRESE_ASSOCIATE!I138","v":0}]
[1,null,{"$f":"IF(ALL_C_IMPRESE_ASSOCIATE!C139=\"\",\"\",ALL_C_IMPRESE_ASSOCIATE!C139)","v":""},40,{"$f":"ALL_C_IMPRESE_ASSOCIATE!E139","v":0},{"$f":"ALL_C_IMPRESE_ASSOCIATE!F139","v":0},{"$f":"ALL_C_IMPRESE_ASSOCIATE!G139","v":0},{"$f":"ALL_C_IMPRESE_ASSOCIATE!I139","v":0}]
[1,null,{"$f":"IF(ALL_C_IMPRESE_ASSOCIATE!C140=\"\",\"\",ALL_C_IMPRESE_ASSOCIATE!C140)","v":""},40,{"$f":"ALL_C_IMPRESE_ASSOCIATE!E140","v":0},{"$f":"ALL_C_IMPRESE_ASSOCIATE!F140","v":0},{"$f":"ALL_C_IMPRESE_ASSOCIATE!G140","v":0},{"$f":"ALL_C_IMPRESE_ASSOCIATE!I140","v":0}]

{"sheet":"EXP_PREV_COSTI_IMPRESE_ASS_FIN","index":29,"n_rows":91,"n_cols":12,"rows_kept":91,"cut":false,"hidden":true,"merged":[]}
["ID","ID_PROGRAMMA_IMPRESA_ASS","IMPRESA_ASSOCIATA_DESC","ID_FINALITA_COSTO","ANNO 1","ANNO 2","ANNO 3","ANNO OLTRE",null,null,"ID","DESCRIZIONE"]
[1,null,{"$f":"IF(ALL_C_IMPRESE_ASSOCIATE!C180=\"\",\"\",ALL_C_IMPRESE_ASSOCIATE!C180)","v":0},10,{"$f":"ALL_C_IMPRESE_ASSOCIATE!E180","v":0},{"$f":"ALL_C_IMPRESE_ASSOCIATE!F180","v":0},{"$f":"ALL_C_IMPRESE_ASSOCIATE!G180","v":0},{"$f":"ALL_C_IMPRESE_ASSOCIATE!I180","v":0},null,null,10,"STUDI DI FATTIBILITA' TECNICA"]
[1,null,{"$f":"IF(ALL_C_IMPRESE_ASSOCIATE!C181=\"\",\"\",ALL_C_IMPRESE_ASSOCIATE!C181)","v":""},10,{"$f":"ALL_C_IMPRESE_ASSOCIATE!E181","v":0},{"$f":"ALL_C_IMPRESE_ASSOCIATE!F181","v":0},{"$f":"ALL_C_IMPRESE_ASSOCIATE!G181","v":0},{"$f":"ALL_C_IMPRESE_ASSOCIATE!I181","v":0},null,null,20,"RICERCA INDUSTRIALE"]
[1,null,{"$f":"IF(ALL_C_IMPRESE_ASSOCIATE!C182=\"\",\"\",ALL_C_IMPRESE_ASSOCIATE!C182)","v":""},10,{"$f":"ALL_C_IMPRESE_ASSOCIATE!E182","v":0},{"$f":"ALL_C_IMPRESE_ASSOCIATE!F182","v":0},{"$f":"ALL_C_IMPRESE_ASSOCIATE!G182","v":0},{"$f":"ALL_C_IMPRESE_ASSOCIATE!I182","v":0},null,null,30,"SVILUPPO SPERIMENTALE"]
[1,null,{"$f":"IF(ALL_C_IMPRESE_ASSOCIATE!C183=\"\",\"\",ALL_C_IMPRESE_ASSOCIATE!C183)","v":""},10,{"$f":"ALL_C_IMPRESE_ASSOCIATE!E183","v":0},{"$f":"ALL_C_IMPRESE_ASSOCIATE!F183","v":0},{"$f":"ALL_C_IMPRESE_ASSOCIATE!G183","v":0},{"$f":"ALL_C_IMPRESE_ASSOCIATE!I183","v":0}]
[1,null,{"$f":"IF(ALL_C_IMPRESE_ASSOCIATE!C184=\"\",\"\",ALL_C_IMPRESE_ASSOCIATE!C184)","v":""},10,{"$f":"ALL_C_IMPRESE_ASSOCIATE!E184","v":0},{"$f":"ALL_C_IMPRESE_ASSOCIATE!F184","v":0},{"$f":"ALL_C_IMPRESE_ASSOCIATE!G184","v":0},{"$f":"ALL_C_IMPRESE_ASSOCIATE!I184","v":0}]
[1,null,{"$f":"IF(ALL_C_IMPRESE_ASSOCIATE!C185=\"\",\"\",ALL_C_IMPRESE_ASSOCIATE!C185)","v":""},10,{"$f":"ALL_C_IMPRESE_ASSOCIATE!E185","v":0},{"$f":"ALL_C_IMPRESE_ASSOCIATE!F185","v":0},{"$f":"ALL_C_IMPRESE_ASSOCIATE!G185","v":0},{"$f":"ALL_C_IMPRESE_ASSOCIATE!I185","v":0}]
[1,null,{"$f":"IF(ALL_C_IMPRESE_ASSOCIATE!C186=\"\",\"\",ALL_C_IMPRESE_ASSOCIATE!C186)","v":""},10,{"$f":"ALL_C_IMPRESE_ASSOCIATE!E186","v":0},{"$f":"ALL_C_IMPRESE_ASSOCIATE!F186","v":0},{"$f":"ALL_C_IMPRESE_ASSOCIATE!G186","v":0},{"$f":"ALL_C_IMPRESE_ASSOCIATE!I186","v":0}]
[1,null,{"$f":"IF(ALL_C_IMPRESE_ASSOCIATE!C187=\"\",\"\",ALL_C_IMPRESE_ASSOCIATE!C187)","v":""},10,{"$f":"ALL_C_IMPRESE_ASSOCIATE!E187","v":0},{"$f":"ALL_C_IMPRESE_ASSOCIATE!F187","v":0},{"$f":"ALL_C_IMPRESE_ASSOCIATE!G187","v":0},{"$f":"ALL_C_IMPRESE_ASSOCIATE!I187","v":0}]
[1,null,{"$f":"IF(ALL_C_IMPRESE_ASSOCIATE!C188=\"\",\"\",ALL_C_IMPRESE_ASSOCIATE!C188)","v":""},10,{"$f":"ALL_C_IMPRESE_ASSOCIATE!E188","v":0},{"$f":"ALL_C_IMPRESE_ASSOCIATE!F188","v":0},{"$f":"ALL_C_IMPRESE_ASSOCIATE!G188","v":0},{"$f":"ALL_C_IMPRESE_ASSOCIATE!I188","v":0}]
[1,null,{"$f":"IF(ALL_C_IMPRESE_ASSOCIATE!C189=\"\",\"\",ALL_C_IMPRESE_ASSOCIATE!C189)","v":""},10,{"$f":"ALL_C_IMPRESE_ASSOCIATE!E189","v":0},{"$f":"ALL_C_IMPRESE_ASSOCIATE!F189","v":0},{"$f":"ALL_C_IMPRESE_ASSOCIATE!G189","v":0},{"$f":"ALL_C_IMPRESE_ASSOCIATE!I189","v":0}]
[1,null,{"$f":"IF(ALL_C_IMPRESE_ASSOCIATE!C190=\"\",\"\",ALL_C_IMPRESE_ASSOCIATE!C190)","v":""},10,{"$f":"ALL_C_IMPRESE_ASSOCIATE!E190","v":0},{"$f":"ALL_C_IMPRESE_ASSOCIATE!F190","v":0},{"$f":"ALL_C_IMPRESE_ASSOCIATE!G190","v":0},{"$f":"ALL_C_IMPRESE_ASSOCIATE!I190","v":0}]
[1,null,{"$f":"IF(ALL_C_IMPRESE_ASSOCIATE!C191=\"\",\"\",ALL_C_IMPRESE_ASSOCIATE!C191)","v":""},10,{"$f":"ALL_C_IMPRESE_ASSOCIATE!E191","v":0},{"$f":"ALL_C_IMPRESE_ASSOCIATE!F191","v":0},{"$f":"ALL_C_IMPRESE_ASSOCIATE!G191","v":0},{"$f":"ALL_C_IMPRESE_ASSOCIATE!I191","v":0}]
[1,null,{"$f":"IF(ALL_C_IMPRESE_ASSOCIATE!C192=\"\",\"\",ALL_C_IMPRESE_ASSOCIATE!C192)","v":""},10,{"$f":"ALL_C_IMPRESE_ASSOCIATE!E192","v":0},{"$f":"ALL_C_IMPRESE_ASSOCIATE!F192","v":0},{"$f":"ALL_C_IMPRESE_ASSOCIATE!G192","v":0},{"$f":"ALL_C_IMPRESE_ASSOCIATE!I192","v":0}]
[1,null,{"$f":"IF(ALL_C_IMPRESE_ASSOCIATE!C193=\"\",\"\",ALL_C_IMPRESE_ASSOCIATE!C193)","v":""},10,{"$f":"ALL_C_IMPRESE_ASSOCIATE!E193","v":0},{"$f":"ALL_C_IMPRESE_ASSOCIATE!F193","v":0},{"$f":"ALL_C_IMPRESE_ASSOCIATE!G193","v":0},{"$f":"ALL_C_IMPRESE_ASSOCIATE!I193","v":0}]
[1,null,{"$f":"IF(ALL_C_IMPRESE_ASSOCIATE!C194=\"\",\"\",ALL_C_IMPRESE_ASSOCIATE!C194)","v":""},10,{"$f":"ALL_C_IMPRESE_ASSOCIATE!E194","v":0},{"$f":"ALL_C_IMPRESE_ASSOCIATE!F194","v":0},{"$f":"ALL_C_IMPRESE_ASSOCIATE!G194","v":0},{"$f":"ALL_C_IMPRESE_ASSOCIATE!I194","v":0}]
[1,null,{"$f":"IF(ALL_C_IMPRESE_ASSOCIATE!C195=\"\",\"\",ALL_C_IMPRESE_ASSOCIATE!C195)","v":""},10,{"$f":"ALL_C_IMPRESE_ASSOCIATE!E195","v":0},{"$f":"ALL_C_IMPRESE_ASSOCIATE!F195","v":0},{"$f":"ALL_C_IMPRESE_ASSOCIATE!G195","v":0},{"$f":"ALL_C_IMPRESE_ASSOCIATE!I195","v":0}]
[1,null,{"$f":"IF(ALL_C_IMPRESE_ASSOCIATE!C196=\"\",\"\",ALL_C_IMPRESE_ASSOCIATE!C196)","v":""},10,{"$f":"ALL_C_IMPRESE_ASSOCIATE!E196","v":0},{"$f":"ALL_C_IMPRESE_ASSOCIATE!F196","v":0},{"$f":"ALL_C_IMPRESE_ASSOCIATE!G196","v":0},{"$f":"ALL_C_IMPRESE_ASSOCIATE!I196","v":0}]
[1,null,{"$f":"IF(ALL_C_IMPRESE_ASSOCIATE!C197=\"\",\"\",ALL_C_IMPRESE_ASSOCIATE!C197)","v":""},10,{"$f":"ALL_C_IMPRESE_ASSOCIATE!E197","v":0},{"$f":"ALL_C_IMPRESE_ASSOCIATE!F197","v":0},{"$f":"ALL_C_IMPRESE_ASSOCIATE!G197","v":0},{"$f":"ALL_C_IMPRESE_ASSOCIATE!I197","v":0}]
[1,null,{"$f":"IF(ALL_C_IMPRESE_ASSOCIATE!C198=\"\",\"\",ALL_C_IMPRESE_ASSOCIATE!C198)","v":""},10,{"$f":"ALL_C_IMPRESE_ASSOCIATE!E198","v":0},{"$f":"ALL_C_IMPRESE_ASSOCIATE!F198","v":0},{"$f":"ALL_C_IMPRESE_ASSOCIATE!G198","v":0},{"$f":"ALL_C_IMPRESE_ASSOCIATE!I198","v":0}]
[1,null,{"$f":"IF(ALL_C_IMPRESE_ASSOCIATE!C199=\"\",\"\",ALL_C_IMPRESE_ASSOCIATE!C199)","v":""},10,{"$f":"ALL_C_IMPRESE_ASSOCIATE!E199","v":0},{"$f":"ALL_C_IMPRESE_ASSOCIATE!F199","v":0},{"$f":"ALL_C_IMPRESE_ASSOCIATE!G199","v":0},{"$f":"ALL_C_IMPRESE_ASSOCIATE!I199","v":0}]
[1,null,{"$f":"IF(ALL_C_IMPRESE_ASSOCIATE!C200=\"\",\"\",ALL_C_IMPRESE_ASSOCIATE!C200)","v":""},10,{"$f":"ALL_C_IMPRESE_ASSOCIATE!E200","v":0},{"$f":"ALL_C_IMPRESE_ASSOCIATE!F200","v":0},{"$f":"ALL_C_IMPRESE_ASSOCIATE!G200","v":0},{"$f":"ALL_C_IMPRESE_ASSOCIATE!I200","v":0}]
[1,null,{"$f":"IF(ALL_C_IMPRESE_ASSOCIATE!C201=\"\",\"\",ALL_C_IMPRESE_ASSOCIATE!C201)","v":""},10,{"$f":"ALL_C_IMPRESE_ASSOCIATE!E201","v":0},{"$f":"ALL_C_IMPRESE_ASSOCIATE!F201","v":0},{"$f":"ALL_C_IMPRESE_ASSOCIATE!G201","v":0},{"$f":"ALL_C_IMPRESE_ASSOCIATE!I201","v":0}]
[1,null,{"$f":"IF(ALL_C_IMPRESE_ASSOCIATE!C202=\"\",\"\",ALL_C_IMPRESE_ASSOCIATE!C202)","v":""},10,{"$f":"ALL_C_IMPRESE_ASSOCIATE!E202","v":0},{"$f":"ALL_C_IMPRESE_ASSOCIATE!F202","v":0},{"$f":"ALL_C_IMPRESE_ASSOCIATE!G202","v":0},{"$f":"ALL_C_IMPRESE_ASSOCIATE!I202","v":0}]
[1,null,{"$f":"IF(ALL_C_IMPRESE_ASSOCIATE!C203=\"\",\"\",ALL_C_IMPRESE_ASSOCIATE!C203)","v":""},10,{"$f":"ALL_C_IMPRESE_ASSOCIATE!E203","v":0},{"$f":"ALL_C_IMPRESE_ASSOCIATE!F203","v":0},{"$f":"ALL_C_IMPRESE_ASSOCIATE!G203","v":0},{"$f":"ALL_C_IMPRESE_ASSOCIATE!I203","v":0}]
[1,null,{"$f":"IF(ALL_C_IMPRESE_ASSOCIATE!C204=\"\",\"\",ALL_C_IMPRESE_ASSOCIATE!C204)","v":""},10,{"$f":"ALL_C_IMPRESE_ASSOCIATE!E204","v":0},{"$f":"ALL_C_IMPRESE_ASSOCIATE!F204","v":0},{"$f":"ALL_C_IMPRESE_ASSOCIATE!G204","v":0},{"$f":"ALL_C_IMPRESE_ASSOCIATE!I204","v":0}]
[1,null,{"$f":"IF(ALL_C_IMPRESE_ASSOCIATE!C205=\"\",\"\",ALL_C_IMPRESE_ASSOCIATE!C205)","v":""},10,{"$f":"ALL_C_IMPRESE_ASSOCIATE!E205","v":0},{"$f":"ALL_C_IMPRESE_ASSOCIATE!F205","v":0},{"$f":"ALL_C_IMPRESE_ASSOCIATE!G205","v":0},{"$f":"ALL_C_IMPRESE_ASSOCIATE!I205","v":0}]
[1,null,{"$f":"IF(ALL_C_IMPRESE_ASSOCIATE!C206=\"\",\"\",ALL_C_IMPRESE_ASSOCIATE!C206)","v":""},10,{"$f":"ALL_C_IMPRESE_ASSOCIATE!E206","v":0},{"$f":"ALL_C_IMPRESE_ASSOCIATE!F206","v":0},{"$f":"ALL_C_IMPRESE_ASSOCIATE!G206","v":0},{"$f":"ALL_C_IMPRESE_ASSOCIATE!I206","v":0}]
[1,null,{"$f":"IF(ALL_C_IMPRESE_ASSOCIATE!C207=\"\",\"\",ALL_C_IMPRESE_ASSOCIATE!C207)","v":""},10,{"$f":"ALL_C_IMPRESE_ASSOCIATE!E207","v":0},{"$f":"ALL_C_IMPRESE_ASSOCIATE!F207","v":0},{"$f":"ALL_C_IMPRESE_ASSOCIATE!G207","v":0},{"$f":"ALL_C_IMPRESE_ASSOCIATE!I207","v":0}]
[1,null,{"$f":"IF(ALL_C_IMPRESE_ASSOCIATE!C208=\"\",\"\",ALL_C_IMPRESE_ASSOCIATE!C208)","v":""},10,{"$f":"ALL_C_IMPRESE_ASSOCIATE!E208","v":0},{"$f":"ALL_C_IMPRESE_ASSOCIATE!F208","v":0},{"$f":"ALL_C_IMPRESE_ASSOCIATE!G208","v":0},{"$f":"ALL_C_IMPRESE_ASSOCIATE!I208","v":0}]
[1,null,{"$f":"IF(ALL_C_IMPRESE_ASSOCIATE!C209=\"\",\"\",ALL_C_IMPRESE_ASSOCIATE!C209)","v":""},10,{"$f":"ALL_C_IMPRESE_ASSOCIATE!E209","v":0},{"$f":"ALL_C_IMPRESE_ASSOCIATE!F209","v":0},{"$f":"ALL_C_IMPRESE_ASSOCIATE!G209","v":0},{"$f":"ALL_C_IMPRESE_ASSOCIATE!I209","v":0}]
[1,null,{"$f":"IF(ALL_C_IMPRESE_ASSOCIATE!C212=\"\",\"\",ALL_C_IMPRESE_ASSOCIATE!C212)","v":0},20,{"$f":"ALL_C_IMPRESE_ASSOCIATE!E212","v":0},{"$f":"ALL_C_IMPRESE_ASSOCIATE!F212","v":0},{"$f":"ALL_C_IMPRESE_ASSOCIATE!G212","v":0},{"$f":"ALL_C_IMPRESE_ASSOCIATE!I212","v":0}]
[1,null,{"$f":"IF(ALL_C_IMPRESE_ASSOCIATE!C213=\"\",\"\",ALL_C_IMPRESE_ASSOCIATE!C213)","v":""},20,{"$f":"ALL_C_IMPRESE_ASSOCIATE!E213","v":0},{"$f":"ALL_C_IMPRESE_ASSOCIATE!F213","v":0},{"$f":"ALL_C_IMPRESE_ASSOCIATE!G213","v":0},{"$f":"ALL_C_IMPRESE_ASSOCIATE!I213","v":0}]
[1,null,{"$f":"IF(ALL_C_IMPRESE_ASSOCIATE!C214=\"\",\"\",ALL_C_IMPRESE_ASSOCIATE!C214)","v":""},20,{"$f":"ALL_C_IMPRESE_ASSOCIATE!E214","v":0},{"$f":"ALL_C_IMPRESE_ASSOCIATE!F214","v":0},{"$f":"ALL_C_IMPRESE_ASSOCIATE!G214","v":0},{"$f":"ALL_C_IMPRESE_ASSOCIATE!I214","v":0}]
[1,null,{"$f":"IF(ALL_C_IMPRESE_ASSOCIATE!C215=\"\",\"\",ALL_C_IMPRESE_ASSOCIATE!C215)","v":""},20,{"$f":"ALL_C_IMPRESE_ASSOCIATE!E215","v":0},{"$f":"ALL_C_IMPRESE_ASSOCIATE!F215","v":0},{"$f":"ALL_C_IMPRESE_ASSOCIATE!G215","v":0},{"$f":"ALL_C_IMPRESE_ASSOCIATE!I215","v":0}]
[1,null,{"$f":"IF(ALL_C_IMPRESE_ASSOCIATE!C216=\"\",\"\",ALL_C_IMPRESE_ASSOCIATE!C216)","v":""},20,{"$f":"ALL_C_IMPRESE_ASSOCIATE!E216","v":0},{"$f":"ALL_C_IMPRESE_ASSOCIATE!F216","v":0},{"$f":"ALL_C_IMPRESE_ASSOCIATE!G216","v":0},{"$f":"ALL_C_IMPRESE_ASSOCIATE!I216","v":0}]
[1,null,{"$f":"IF(ALL_C_IMPRESE_ASSOCIATE!C217=\"\",\"\",ALL_C_IMPRESE_ASSOCIATE!C217)","v":""},20,{"$f":"ALL_C_IMPRESE_ASSOCIATE!E217","v":0},{"$f":"ALL_C_IMPRESE_ASSOCIATE!F217","v":0},{"$f":"ALL_C_IMPRESE_ASSOCIATE!G217","v":0},{"$f":"ALL_C_IMPRESE_ASSOCIATE!I217","v":0}]
[1,null,{"$f":"IF(ALL_C_IMPRESE_ASSOCIATE!C218=\"\",\"\",ALL_C_IMPRESE_ASSOCIATE!C218)","v":""},20,{"$f":"ALL_C_IMPRESE_ASSOCIATE!E218","v":0},{"$f":"ALL_C_IMPRESE_ASSOCIATE!F218","v":0},{"$f":"ALL_C_IMPRESE_ASSOCIATE!G218","v":0},{"$f":"ALL_C_IMPRESE_ASSOCIATE!I218","v":0}]
[1,null,{"$f":"IF(ALL_C_IMPRESE_ASSOCIATE!C219=\"\",\"\",ALL_C_IMPRESE_ASSOCIATE!C219)","v":""},20,{"$f":"ALL_C_IMPRESE_ASSOCIATE!E219","v":0},{"$f":"ALL_C_IMPRESE_ASSOCIATE!F219","v":0},{"$f":"ALL_C_IMPRESE_ASSOCIATE!G219","v":0},{"$f":"ALL_C_IMPRESE_ASSOCIATE!I219","v":0}]
[1,null,{"$f":"IF(ALL_C_IMPRESE_ASSOCIATE!C220=\"\",\"\",ALL_C_IMPRESE_ASSOCIATE!C220)","v":""},20,{"$f":"ALL_C_IMPRESE_ASSOCIATE!E220","v":0},{"$f":"ALL_C_IMPRESE_ASSOCIATE!F220","v":0},{"$f":"ALL_C_IMPRESE_ASSOCIATE!G220","v":0},{"$f":"ALL_C_IMPRESE_ASSOCIATE!I220","v":0}]
[1,null,{"$f":"IF(ALL_C_IMPRESE_ASSOCIATE!C221=\"\",\"\",ALL_C_IMPRESE_ASSOCIATE!C221)","v":""},20,{"$f":"ALL_C_IMPRESE_ASSOCIATE!E221","v":0},{"$f":"ALL_C_IMPRESE_ASSOCIATE!F221","v":0},{"$f":"ALL_C_IMPRESE_ASSOCIATE!G221","v":0},{"$f":"ALL_C_IMPRESE_ASSOCIATE!I221","v":0}]
[1,null,{"$f":"IF(ALL_C_IMPRESE_ASSOCIATE!C222=\"\",\"\",ALL_C_IMPRESE_ASSOCIATE!C222)","v":""},20,{"$f":"ALL_C_IMPRESE_ASSOCIATE!E222","v":0},{"$f":"ALL_C_IMPRESE_ASSOCIATE!F222","v":0},{"$f":"ALL_C_IMPRESE_ASSOCIATE!G222","v":0},{"$f":"ALL_C_IMPRESE_ASSOCIATE!I222","v":0}]
[1,null,{"$f":"IF(ALL_C_IMPRESE_ASSOCIATE!C223=\"\",\"\",ALL_C_IMPRESE_ASSOCIATE!C223)","v":""},20,{"$f":"ALL_C_IMPRESE_ASSOCIATE!E223","v":0},{"$f":"ALL_C_IMPRESE_ASSOCIATE!F223","v":0},{"$f":"ALL_C_IMPRESE_ASSOCIATE!G223","v":0},{"$f":"ALL_C_IMPRESE_ASSOCIATE!I223","v":0}]
[1,null,{"$f":"IF(ALL_C_IMPRESE_ASSOCIATE!C224=\"\",\"\",ALL_C_IMPRESE_ASSOCIATE!C224)","v":""},20,{"$f":"ALL_C_IMPRESE_ASSOCIATE!E224","v":0},{"$f":"ALL_C_IMPRESE_ASSOCIATE!F224","v":0},{"$f":"ALL_C_IMPRESE_ASSOCIATE!G224","v":0},{"$f":"ALL_C_IMPRESE_ASSOCIATE!I224","v":0}]
[1,null,{"$f":"IF(ALL_C_IMPRESE_ASSOCIATE!C225=\"\",\"\",ALL_C_IMPRESE_ASSOCIATE!C225)","v":""},20,{"$f":"ALL_C_IMPRESE_ASSOCIATE!E225","v":0},{"$f":"ALL_C_IMPRESE_ASSOCIATE!F225","v":0},{"$f":"ALL_C_IMPRESE_ASSOCIATE!G225","v":0},{"$f":"ALL_C_IMPRESE_ASSOCIATE!I225","v":0}]
[1,null,{"$f":"IF(ALL_C_IMPRESE_ASSOCIATE!C226=\"\",\"\",ALL_C_IMPRESE_ASSOCIATE!C226)","v":""},20,{"$f":"ALL_C_IMPRESE_ASSOCIATE!E226","v":0},{"$f":"ALL_C_IMPRESE_ASSOCIATE!F226","v":0},{"$f":"ALL_C_IMPRESE_ASSOCIATE!G226","v":0},{"$f":"ALL_C_IMPRESE_ASSOCIATE!I226","v":0}]
[1,null,{"$f":"IF(ALL_C_IMPRESE_ASSOCIATE!C227=\"\",\"\",ALL_C_IMPRESE_ASSOCIATE!C227)","v":""},20,{"$f":"ALL_C_IMPRESE_ASSOCIATE!E227","v":0},{"$f":"ALL_C_IMPRESE_ASSOCIATE!F227","v":0},{"$f":"ALL_C_IMPRESE_ASSOCIATE!G227","v":0},{"$f":"ALL_C_IMPRESE_ASSOCIATE!I227","v":0}]
[1,null,{"$f":"IF(ALL_C_IMPRESE_ASSOCIATE!C228=\"\",\"\",ALL_C_IMPRESE_ASSOCIATE!C228)","v":""},20,{"$f":"ALL_C_IMPRESE_ASSOCIATE!E228","v":0},{"$f":"ALL_C_IMPRESE_ASSOCIATE!F228","v":0},{"$f":"ALL_C_IMPRESE_ASSOCIATE!G228","v":0},{"$f":"ALL_C_IMPRESE_ASSOCIATE!I228","v":0}]
[1,null,{"$f":"IF(ALL_C_IMPRESE_ASSOCIATE!C229=\"\",\"\",ALL_C_IMPRESE_ASSOCIATE!C229)","v":""},20,{"$f":"ALL_C_IMPRESE_ASSOCIATE!E229","v":0},{"$f":"ALL_C_IMPRESE_ASSOCIATE!F229","v":0},{"$f":"ALL_C_IMPRESE_ASSOCIATE!G229","v":0},{"$f":"ALL_C_IMPRESE_ASSOCIATE!I229","v":0}]
[1,null,{"$f":"IF(ALL_C_IMPRESE_ASSOCIATE!C230=\"\",\"\",ALL_C_IMPRESE_ASSOCIATE!C230)","v":""},20,{"$f":"ALL_C_IMPRESE_ASSOCIATE!E230","v":0},{"$f":"ALL_C_IMPRESE_ASSOCIATE!F230","v":0},{"$f":"ALL_C_IMPRESE_ASSOCIATE!G230","v":0},{"$f":"ALL_C_IMPRESE_ASSOCIATE!I230","v":0}]
[1,null,{"$f":"IF(ALL_C_IMPRESE_ASSOCIATE!C231=\"\",\"\",ALL_C_IMPRESE_ASSOCIATE!C231)","v":""},20,{"$f":"ALL_C_IMPRESE_ASSOCIATE!E231","v":0},{"$f":"ALL_C_IMPRESE_ASSOCIATE!F231","v":0},{"$f":"ALL_C_IMPRESE_ASSOCIATE!G231","v":0},{"$f":"ALL_C_IMPRESE_ASSOCIATE!I231","v":0}]
[1,null,{"$f":"IF(ALL_C_IMPRESE_ASSOCIATE!C232=\"\",\"\",ALL_C_IMPRESE_ASSOCIATE!C232)","v":""},20,{"$f":"ALL_C_IMPRESE_ASSOCIATE!E232","v":0},{"$f":"ALL_C_IMPRESE_ASSOCIATE!F232","v":0},{"$f":"ALL_C_IMPRESE_ASSOCIATE!G232","v":0},{"$f":"ALL_C_IMPRESE_ASSOCIATE!I232","v":0}]
[1,null,{"$f":"IF(ALL_C_IMPRESE_ASSOCIATE!C233=\"\",\"\",ALL_C_IMPRESE_ASSOCIATE!C233)","v":""},20,{"$f":"ALL_C_IMPRESE_ASSOCIATE!E233","v":0},{"$f":"ALL_C_IMPRESE_ASSOCIATE!F233","v":0},{"$f":"ALL_C_IMPRESE_ASSOCIATE!G233","v":0},{"$f":"ALL_C_IMPRESE_ASSOCIATE!I233","v":0}]
[1,null,{"$f":"IF(ALL_C_IMPRESE_ASSOCIATE!C234=\"\",\"\",ALL_C_IMPRESE_ASSOCIATE!C234)","v":""},20,{"$f":"ALL_C_IMPRESE_ASSOCIATE!E234","v":0},{"$f":"ALL_C_IMPRESE_ASSOCIATE!F234","v":0},{"$f":"ALL_C_IMPRESE_ASSOCIATE!G234","v":0},{"$f":"ALL_C_IMPRESE_ASSOCIATE!I234","v":0}]
[1,null,{"$f":"IF(ALL_C_IMPRESE_ASSOCIATE!C235=\"\",\"\",ALL_C_IMPRESE_ASSOCIATE!C235)","v":""},20,{"$f":"ALL_C_IMPRESE_ASSOCIATE!E235","v":0},{"$f":"ALL_C_IMPRESE_ASSOCIATE!F235","v":0},{"$f":"ALL_C_IMPRESE_ASSOCIATE!G235","v":0},{"$f":"ALL_C_IMPRESE_ASSOCIATE!I235","v":0}]
[1,null,{"$f":"IF(ALL_C_IMPRESE_ASSOCIATE!C236=\"\",\"\",ALL_C_IMPRESE_ASSOCIATE!C236)","v":""},20,{"$f":"ALL_C_IMPRESE_ASSOCIATE!E236","v":0},{"$f":"ALL_C_IMPRESE_ASSOCIATE!F236","v":0},{"$f":"ALL_C_IMPRESE_ASSOCIATE!G236","v":0},{"$f":"ALL_C_IMPRESE_ASSOCIATE!I236","v":0}]
[1,null,{"$f":"IF(ALL_C_IMPRESE_ASSOCIATE!C237=\"\",\"\",ALL_C_IMPRESE_ASSOCIATE!C237)","v":""},20,{"$f":"ALL_C_IMPRESE_ASSOCIATE!E237","v":0},{"$f":"ALL_C_IMPRESE_ASSOCIATE!F237","v":0},{"$f":"ALL_C_IMPRESE_ASSOCIATE!G237","v":0},{"$f":"ALL_C_IMPRESE_ASSOCIATE!I237","v":0}]
[1,null,{"$f":"IF(ALL_C_IMPRESE_ASSOCIATE!C238=\"\",\"\",ALL_C_IMPRESE_ASSOCIATE!C238)","v":""},20,{"$f":"ALL_C_IMPRESE_ASSOCIATE!E238","v":0},{"$f":"ALL_C_IMPRESE_ASSOCIATE!F238","v":0},{"$f":"ALL_C_IMPRESE_ASSOCIATE!G238","v":0},{"$f":"ALL_C_IMPRESE_ASSOCIATE!I238","v":0}]
[1,null,{"$f":"IF(ALL_C_IMPRESE_ASSOCIATE!C239=\"\",\"\",ALL_C_IMPRESE_ASSOCIATE!C239)","v":""},20,{"$f":"ALL_C_IMPRESE_ASSOCIATE!E239","v":0},{"$f":"ALL_C_IMPRESE_ASSOCIATE!F239","v":0},{"$f":"ALL_C_IMPRESE_ASSOCIATE!G239","v":0},{"$f":"ALL_C_IMPRESE_ASSOCIATE!I239","v":0}]
[1,null,{"$f":"IF(ALL_C_IMPRESE_ASSOCIATE!C240=\"\",\"\",ALL_C_IMPRESE_ASSOCIATE!C240)","v":""},20,{"$f":"ALL_C_IMPRESE_ASSOCIATE!E240","v":0},{"$f":"ALL_C_IMPRESE_ASSOCIATE!F240","v":0},{"$f":"ALL_C_IMPRESE_ASSOCIATE!G240","v":0},{"$f":"ALL_C_IMPRESE_ASSOCIATE!I240","v":0}]
[1,null,{"$f":"IF(ALL_C_IMPRESE_ASSOCIATE!C241=\"\",\"\",ALL_C_IMPRESE_ASSOCIATE!C241)","v":""},20,{"$f":"ALL_C_IMPRESE_ASSOCIATE!E241","v":0},{"$f":"ALL_C_IMPRESE_ASSOCIATE!F241","v":0},{"$f":"ALL_C_IMPRESE_ASSOCIATE!G241","v":0},{"$f":"ALL_C_IMPRESE_ASSOCIATE!I241","v":0}]
[1,null,{"$f":"IF(ALL_C_IMPRESE_ASSOCIATE!C244=\"\",\"\",ALL_C_IMPRESE_ASSOCIATE!C244)","v":0},30,{"$f":"ALL_C_IMPRESE_ASSOCIATE!E244","v":0},{"$f":"ALL_C_IMPRESE_ASSOCIATE!F244","v":0},{"$f":"ALL_C_IMPRESE_ASSOCIATE!G244","v":0},{"$f":"ALL_C_IMPRESE_ASSOCIATE!I244","v":0}]
[1,null,{"$f":"IF(ALL_C_IMPRESE_ASSOCIATE!C245=\"\",\"\",ALL_C_IMPRESE_ASSOCIATE!C245)","v":""},30,{"$f":"ALL_C_IMPRESE_ASSOCIATE!E245","v":0},{"$f":"ALL_C_IMPRESE_ASSOCIATE!F245","v":0},{"$f":"ALL_C_IMPRESE_ASSOCIATE!G245","v":0},{"$f":"ALL_C_IMPRESE_ASSOCIATE!I245","v":0}]
[1,null,{"$f":"IF(ALL_C_IMPRESE_ASSOCIATE!C246=\"\",\"\",ALL_C_IMPRESE_ASSOCIATE!C246)","v":""},30,{"$f":"ALL_C_IMPRESE_ASSOCIATE!E246","v":0},{"$f":"ALL_C_IMPRESE_ASSOCIATE!F246","v":0},{"$f":"ALL_C_IMPRESE_ASSOCIATE!G246","v":0},{"$f":"ALL_C_IMPRESE_ASSOCIATE!I246","v":0}]
[1,null,{"$f":"IF(ALL_C_IMPRESE_ASSOCIATE!C247=\"\",\"\",ALL_C_IMPRESE_ASSOCIATE!C247)","v":""},30,{"$f":"ALL_C_IMPRESE_ASSOCIATE!E247","v":0},{"$f":"ALL_C_IMPRESE_ASSOCIATE!F247","v":0},{"$f":"ALL_C_IMPRESE_ASSOCIATE!G247","v":0},{"$f":"ALL_C_IMPRESE_ASSOCIATE!I247","v":0}]
[1,null,{"$f":"IF(ALL_C_IMPRESE_ASSOCIATE!C248=\"\",\"\",ALL_C_IMPRESE_ASSOCIATE!C248)","v":""},30,{"$f":"ALL_C_IMPRESE_ASSOCIATE!E248","v":0},{"$f":"ALL_C_IMPRESE_ASSOCIATE!F248","v":0},{"$f":"ALL_C_IMPRESE_ASSOCIATE!G248","v":0},{"$f":"ALL_C_IMPRESE_ASSOCIATE!I248","v":0}]
[1,null,{"$f":"IF(ALL_C_IMPRESE_ASSOCIATE!C249=\"\",\"\",ALL_C_IMPRESE_ASSOCIATE!C249)","v":""},30,{"$f":"ALL_C_IMPRESE_ASSOCIATE!E249","v":0},{"$f":"ALL_C_IMPRESE_ASSOCIATE!F249","v":0},{"$f":"ALL_C_IMPRESE_ASSOCIATE!G249","v":0},{"$f":"ALL_C_IMPRESE_ASSOCIATE!I249","v":0}]
[1,null,{"$f":"IF(ALL_C_IMPRESE_ASSOCIATE!C250=\"\",\"\",ALL_C_IMPRESE_ASSOCIATE!C250)","v":""},30,{"$f":"ALL_C_IMPRESE_ASSOCIATE!E250","v":0},{"$f":"ALL_C_IMPRESE_ASSOCIATE!F250","v":0},{"$f":"ALL_C_IMPRESE_ASSOCIATE!G250","v":0},{"$f":"ALL_C_IMPRESE_ASSOCIATE!I250","v":0}]
[1,null,{"$f":"IF(ALL_C_IMPRESE_ASSOCIATE!C251=\"\",\"\",ALL_C_IMPRESE_ASSOCIATE!C251)","v":""},30,{"$f":"ALL_C_IMPRESE_ASSOCIATE!E251","v":0},{"$f":"ALL_C_IMPRESE_ASSOCIATE!F251","v":0},{"$f":"ALL_C_IMPRESE_ASSOCIATE!G251","v":0},{"$f":"ALL_C_IMPRESE_ASSOCIATE!I251","v":0}]
[1,null,{"$f":"IF(ALL_C_IMPRESE_ASSOCIATE!C252=\"\",\"\",ALL_C_IMPRESE_ASSOCIATE!C252)","v":""},30,{"$f":"ALL_C_IMPRESE_ASSOCIATE!E252","v":0},{"$f":"ALL_C_IMPRESE_ASSOCIATE!F252","v":0},{"$f":"ALL_C_IMPRESE_ASSOCIATE!G252","v":0},{"$f":"ALL_C_IMPRESE_ASSOCIATE!I252","v":0}]
[1,null,{"$f":"IF(ALL_C_IMPRESE_ASSOCIATE!C253=\"\",\"\",ALL_C_IMPRESE_ASSOCIATE!C253)","v":""},30,{"$f":"ALL_C_IMPRESE_ASSOCIATE!E253","v":0},{"$f":"ALL_C_IMPRESE_ASSOCIATE!F253","v":0},{"$f":"ALL_C_IMPRESE_ASSOCIATE!G253","v":0},{"$f":"ALL_C_IMPRESE_ASSOCIATE!I253","v":0}]
[1,null,{"$f":"IF(ALL_C_IMPRESE_ASSOCIATE!C254=\"\",\"\",ALL_C_IMPRESE_ASSOCIATE!C254)","v":""},30,{"$f":"ALL_C_IMPRESE_ASSOCIATE!E254","v":0},{"$f":"ALL_C_IMPRESE_ASSOCIATE!F254","v":0},{"$f":"ALL_C_IMPRESE_ASSOCIATE!G254","v":0},{"$f":"ALL_C_IMPRESE_ASSOCIATE!I254","v":0}]
[1,null,{"$f":"IF(ALL_C_IMPRESE_ASSOCIATE!C255=\"\",\"\",ALL_C_IMPRESE_ASSOCIATE!C255)","v":""},30,{"$f":"ALL_C_IMPRESE_ASSOCIATE!E255","v":0},{"$f":"ALL_C_IMPRESE_ASSOCIATE!F255","v":0},{"$f":"ALL_C_IMPRESE_ASSOCIATE!G255","v":0},{"$f":"ALL_C_IMPRESE_ASSOCIATE!I255","v":0}]
[1,null,{"$f":"IF(ALL_C_IMPRESE_ASSOCIATE!C256=\"\",\"\",ALL_C_IMPRESE_ASSOCIATE!C256)","v":""},30,{"$f":"ALL_C_IMPRESE_ASSOCIATE!E256","v":0},{"$f":"ALL_C_IMPRESE_ASSOCIATE!F256","v":0},{"$f":"ALL_C_IMPRESE_ASSOCIATE!G256","v":0},{"$f":"ALL_C_IMPRESE_ASSOCIATE!I256","v":0}]
[1,null,{"$f":"IF(ALL_C_IMPRESE_ASSOCIATE!C257=\"\",\"\",ALL_C_IMPRESE_ASSOCIATE!C257)","v":""},30,{"$f":"ALL_C_IMPRESE_ASSOCIATE!E257","v":0},{"$f":"ALL_C_IMPRESE_ASSOCIATE!F257","v":0},{"$f":"ALL_C_IMPRESE_ASSOCIATE!G257","v":0},{"$f":"ALL_C_IMPRESE_ASSOCIATE!I257","v":0}]
[1,null,{"$f":"IF(ALL_C_IMPRESE_ASSOCIATE!C258=\"\",\"\",ALL_C_IMPRESE_ASSOCIATE!C258)","v":""},30,{"$f":"ALL_C_IMPRESE_ASSOCIATE!E258","v":0},{"$f":"ALL_C_IMPRESE_ASSOCIATE!F258","v":0},{"$f":"ALL_C_IMPRESE_ASSOCIATE!G258","v":0},{"$f":"ALL_C_IMPRESE_ASSOCIATE!I258","v":0}]
[1,null,{"$f":"IF(ALL_C_IMPRESE_ASSOCIATE!C259=\"\",\"\",ALL_C_IMPRESE_ASSOCIATE!C259)","v":""},30,{"$f":"ALL_C_IMPRESE_ASSOCIATE!E259","v":0},{"$f":"ALL_C_IMPRESE_ASSOCIATE!F259","v":0},{"$f":"ALL_C_IMPRESE_ASSOCIATE!G259","v":0},{"$f":"ALL_C_IMPRESE_ASSOCIATE!I259","v":0}]
[1,null,{"$f":"IF(ALL_C_IMPRESE_ASSOCIATE!C260=\"\",\"\",ALL_C_IMPRESE_ASSOCIATE!C260)","v":""},30,{"$f":"ALL_C_IMPRESE_ASSOCIATE!E260","v":0},{"$f":"ALL_C_IMPRESE_ASSOCIATE!F260","v":0},{"$f":"ALL_C_IMPRESE_ASSOCIATE!G260","v":0},{"$f":"ALL_C_IMPRESE_ASSOCIATE!I260","v":0}]
[1,null,{"$f":"IF(ALL_C_IMPRESE_ASSOCIATE!C261=\"\",\"\",ALL_C_IMPRESE_ASSOCIATE!C261)","v":""},30,{"$f":"ALL_C_IMPRESE_ASSOCIATE!E261","v":0},{"$f":"ALL_C_IMPRESE_ASSOCIATE!F261","v":0},{"$f":"ALL_C_IMPRESE_ASSOCIATE!G261","v":0},{"$f":"ALL_C_IMPRESE_ASSOCIATE!I261","v":0}]
[1,null,{"$f":"IF(ALL_C_IMPRESE_ASSOCIATE!C262=\"\",\"\",ALL_C_IMPRESE_ASSOCIATE!C262)","v":""},30,{"$f":"ALL_C_IMPRESE_ASSOCIATE!E262","v":0},{"$f":"ALL_C_IMPRESE_ASSOCIATE!F262","v":0},{"$f":"ALL_C_IMPRESE_ASSOCIATE!G262","v":0},{"$f":"ALL_C_IMPRESE_ASSOCIATE!I262","v":0}]
[1,null,{"$f":"IF(ALL_C_IMPRESE_ASSOCIATE!C263=\"\",\"\",ALL_C_IMPRESE_ASSOCIATE!C263)","v":""},30,{"$f":"ALL_C_IMPRESE_ASSOCIATE!E263","v":0},{"$f":"ALL_C_IMPRESE_ASSOCIATE!F263","v":0},{"$f":"ALL_C_IMPRESE_ASSOCIATE!G263","v":0},{"$f":"ALL_C_IMPRESE_ASSOCIATE!I263","v":0}]
[1,null,{"$f":"IF(ALL_C_IMPRESE_ASSOCIATE!C264=\"\",\"\",ALL_C_IMPRESE_ASSOCIATE!C264)","v":""},30,{"$f":"ALL_C_IMPRESE_ASSOCIATE!E264","v":0},{"$f":"ALL_C_IMPRESE_ASSOCIATE!F264","v":0},{"$f":"ALL_C_IMPRESE_ASSOCIATE!G264","v":0},{"$f":"ALL_C_IMPRESE_ASSOCIATE!I264","v":0}]
[1,null,{"$f":"IF(ALL_C_IMPRESE_ASSOCIATE!C265=\"\",\"\",ALL_C_IMPRESE_ASSOCIATE!C265)","v":""},30,{"$f":"ALL_C_IMPRESE_ASSOCIATE!E265","v":0},{"$f":"ALL_C_IMPRESE_ASSOCIATE!F265","v":0},{"$f":"ALL_C_IMPRESE_ASSOCIATE!G265","v":0},{"$f":"ALL_C_IMPRESE_ASSOCIATE!I265","v":0}]
[1,null,{"$f":"IF(ALL_C_IMPRESE_ASSOCIATE!C266=\"\",\"\",ALL_C_IMPRESE_ASSOCIATE!C266)","v":""},30,{"$f":"ALL_C_IMPRESE_ASSOCIATE!E266","v":0},{"$f":"ALL_C_IMPRESE_ASSOCIATE!F266","v":0},{"$f":"ALL_C_IMPRESE_ASSOCIATE!G266","v":0},{"$f":"ALL_C_IMPRESE_ASSOCIATE!I266","v":0}]
[1,null,{"$f":"IF(ALL_C_IMPRESE_ASSOCIATE!C267=\"\",\"\",ALL_C_IMPRESE_ASSOCIATE!C267)","v":""},30,{"$f":"ALL_C_IMPRESE_ASSOCIATE!E267","v":0},{"$f":"ALL_C_IMPRESE_ASSOCIATE!F267","v":0},{"$f":"ALL_C_IMPRESE_ASSOCIATE!G267","v":0},{"$f":"ALL_C_IMPRESE_ASSOCIATE!I267","v":0}]
[1,null,{"$f":"IF(ALL_C_IMPRESE_ASSOCIATE!C268=\"\",\"\",ALL_C_IMPRESE_ASSOCIATE!C268)","v":""},30,{"$f":"ALL_C_IMPRESE_ASSOCIATE!E268","v":0},{"$f":"ALL_C_IMPRESE_ASSOCIATE!F268","v":0},{"$f":"ALL_C_IMPRESE_ASSOCIATE!G268","v":0},{"$f":"ALL_C_IMPRESE_ASSOCIATE!I268","v":0}]
[1,null,{"$f":"IF(ALL_C_IMPRESE_ASSOCIATE!C269=\"\",\"\",ALL_C_IMPRESE_ASSOCIATE!C269)","v":""},30,{"$f":"ALL_C_IMPRESE_ASSOCIATE!E269","v":0},{"$f":"ALL_C_IMPRESE_ASSOCIATE!F269","v":0},{"$f":"ALL_C_IMPRESE_ASSOCIATE!G269","v":0},{"$f":"ALL_C_IMPRESE_ASSOCIATE!I269","v":0}]
[1,null,{"$f":"IF(ALL_C_IMPRESE_ASSOCIATE!C270=\"\",\"\",ALL_C_IMPRESE_ASSOCIATE!C270)","v":""},30,{"$f":"ALL_C_IMPRESE_ASSOCIATE!E270","v":0},{"$f":"ALL_C_IMPRESE_ASSOCIATE!F270","v":0},{"$f":"ALL_C_IMPRESE_ASSOCIATE!G270","v":0},{"$f":"ALL_C_IMPRESE_ASSOCIATE!I270","v":0}]
[1,null,{"$f":"IF(ALL_C_IMPRESE_ASSOCIATE!C271=\"\",\"\",ALL_C_IMPRESE_ASSOCIATE!C271)","v":""},30,{"$f":"ALL_C_IMPRESE_ASSOCIATE!E271","v":0},{"$f":"ALL_C_IMPRESE_ASSOCIATE!F271","v":0},{"$f":"ALL_C_IMPRESE_ASSOCIATE!G271","v":0},{"$f":"ALL_C_IMPRESE_ASSOCIATE!I271","v":0}]
[1,null,{"$f":"IF(ALL_C_IMPRESE_ASSOCIATE!C272=\"\",\"\",ALL_C_IMPRESE_ASSOCIATE!C272)","v":""},30,{"$f":"ALL_C_IMPRESE_ASSOCIATE!E272","v":0},{"$f":"ALL_C_IMPRESE_ASSOCIATE!F272","v":0},{"$f":"ALL_C_IMPRESE_ASSOCIATE!G272","v":0},{"$f":"ALL_C_IMPRESE_ASSOCIATE!I272","v":0}]
[1,null,{"$f":"IF(ALL_C_IMPRESE_ASSOCIATE!C273=\"\",\"\",ALL_C_IMPRESE_ASSOCIATE!C273)","v":""},30,{"$f":"ALL_C_IMPRESE_ASSOCIATE!E273","v":0},{"$f":"ALL_C_IMPRESE_ASSOCIATE!F273","v":0},{"$f":"ALL_C_IMPRESE_ASSOCIATE!G273","v":0},{"$f":"ALL_C_IMPRESE_ASSOCIATE!I273","v":0}]

{"sheet":"EXP_PREVISIONI_VENDITE","index":30,"n_rows":31,"n_cols":27,"rows_kept":31,"cut":false,"hidden":true,"merged":[]}
["ID","ID_PROGRAMMA","ANNO","N_CONSEGNE_ANNO","PREZZO_UNITARIO"]
[1,null,{"$f":"TRANSPOSE(ALL_D!C11:AF11)","v":0},{"$f":"TRANSPOSE(ALL_D!C12:AF12)","v":0},{"$f":"TRANSPOSE(ALL_D!C14:AF14)","v":0},null,null,null,null,null,null,null,null,null,null,null,null,null,null,null,null,null,null,null,null,{"$f":"IFERROR(SUM(C2:E31),\"#ERR\")","v":435},{"$f":"COUNTIF(X:Z,\"#ERR\")","v":0}]
[1,null,1,0,0]
[1,null,2,0,0]
[1,null,3,0,0]
[1,null,4,0,0]
[1,null,5,0,0]
[1,null,6,0,0]
[1,null,7,0,0]
[1,null,8,0,0]
[1,null,9,0,0]
[1,null,10,0,0]
[1,null,11,0,0]
[1,null,12,0,0]
[1,null,13,0,0]
[1,null,14,0,0]
[1,null,15,0,0]
[1,null,16,0,0]
[1,null,17,0,0]
[1,null,18,0,0]
[1,null,19,0,0]
[1,null,20,0,0]
[1,null,21,0,0]
[1,null,22,0,0]
[1,null,23,0,0]
[1,null,24,0,0]
[1,null,25,0,0]
[1,null,26,0,0]
[1,null,27,0,0]
[1,null,28,0,0]
[1,null,29,0,0]